program: Gaussian 09
title: 000223283
version: EM64L-G09RevD.01
frameworkgroup: C1[X(C20H32N2O3)]
method: RPBEPBE
basis: SDD
operation: Freq
keyword: #p
keyword: freq=noraman
keyword: PBEPBE/SDD
title: #p freq=noraman PBEPBE/SDD
converged: YES YES NO NO
title: Mulliken charges:
elementType: O O O N N C C C C C C C C C C C C C C C C C C C C H H H H H H H H H H H H H H H H H H H H H H H H H H H H H H H H
charge: -0.422920 -0.301281 -0.311173 -0.243354 -0.068968 -0.350189 -0.344769 -0.354501 -0.354761 -0.406543 -0.401869 -0.395966 -0.393659 -0.396702 -0.397447 -0.489631 -0.507974 0.203082 0.468552 -0.085911 -0.026950 -0.588345 0.216795 -0.531528 -0.527547 0.197403 0.252870 0.224095 0.194429 0.216065 0.157840 0.155706 0.235810 0.203174 0.224721 0.213824 0.201550 0.190461 0.220343 0.201975 0.186526 0.187643 0.200969 0.208356 0.186753 0.237496 0.250817 0.228508 0.181551 0.261998 0.402396 0.265636 0.223687 0.213870 0.223621 0.219785 0.243677
chargesum: 0.00000
title: Mulliken charges with hydrogens summed into heavy atoms:
elementType: O O O N N C C C C C C C C C C C C C C C C C C C C
charge: -0.020524 -0.301281 -0.311173 -0.243354 -0.068968 0.100084 0.073756 0.019405 0.036756 0.021352 0.013505 0.014837 -0.005159 -0.008090 -0.002338 -0.001318 -0.097915 0.203082 0.468552 -0.085911 -0.026950 -0.326347 0.216795 0.171664 0.159537
polarizability: 2.65308749e+02 -7.85294045e+00 2.75268514e+02 -1.08886897e+01 9.68800431e+00 1.88848511e+02
1716.lowfreq: -17.6515 -3.8159 -0.0002 0.0001 0.0003 8.6093 12.7877 22.4979 37.2235
frequency: -9.8947 21.9449 37.2057 42.5269 51.9992 61.2276 71.1189 91.6427 99.1370 116.8733 142.8241 153.5793 157.5248 165.8884 184.3408 209.1417 219.6297 229.8185 244.7355 256.0662 267.9604 276.7580 297.1636 311.9151 321.1556 335.0030 367.8984 372.0024 374.5769 413.3988 430.6574 447.3635 450.5466 453.5849 466.0721 472.9510 505.2401 546.3204 558.7660 574.3394 610.7234 659.0964 690.7543 708.6804 748.1108 761.3688 785.6310 803.3151 803.9028 821.6460 850.6851 853.0075 854.1046 856.7154 896.1001 899.7153 903.3313 919.8673 954.9886 956.3491 960.9403 969.2764 980.4335 986.4294 998.0854 1013.7992 1043.0756 1049.3452 1070.2555 1075.8139 1081.6716 1092.0108 1093.5855 1113.7482 1115.3873 1115.5285 1124.0671 1127.9211 1145.8126 1146.7356 1150.3375 1151.3916 1154.0663 1184.8066 1186.3099 1194.2251 1202.0665 1231.9201 1250.5462 1253.3766 1263.4909 1264.2583 1273.7269 1274.4707 1285.1580 1296.1452 1315.0537 1319.8736 1326.6807 1334.1407 1335.5991 1338.0315 1344.9757 1345.8854 1348.0353 1354.2900 1359.4069 1365.5992 1372.2266 1393.0817 1407.5202 1419.9325 1439.4301 1447.6198 1449.7067 1452.8056 1455.7566 1456.0137 1457.5222 1458.8441 1460.2840 1463.5721 1463.9432 1466.1825 1468.5801 1470.7249 1474.9967 1476.4974 1477.6409 1489.3981 1518.3878 1601.2565 1620.5243 2290.2984 2790.6178 2805.2146 2844.6655 2899.0644 2906.9197 2960.4817 2962.1745 2962.8939 2967.4334 2971.3141 2981.7479 2982.1336 2987.0588 2991.5763 3012.9092 3024.6845 3028.2057 3034.5610 3034.5736 3040.4490 3041.4953 3045.3915 3048.8391 3050.7235 3051.0331 3055.4396 3059.0078 3068.1439 3109.2258 3116.9199 3136.0253
redmass: 2.9826 3.8905 3.5697 3.9600 3.6106 3.0941 3.3910 3.6806 2.7567 3.2364 2.6548 2.2988 1.3972 1.3571 2.6267 3.9529 2.7210 2.2936 2.0808 2.8498 2.8305 4.6346 2.3792 5.2954 1.9923 2.2666 2.2419 3.5324 2.7520 4.5157 3.0275 3.0416 2.6080 3.0931 4.8713 3.3118 5.0120 2.2972 2.1172 2.9294 4.6639 4.1803 6.3290 5.8922 4.1015 3.7370 4.1798 1.5044 1.5189 4.6272 2.7621 2.0932 1.7114 1.4728 2.1043 2.5653 1.7302 4.6098 1.4347 1.3533 2.5372 3.1604 2.4299 2.1785 2.6588 3.2187 2.2280 2.2272 1.5788 2.7879 1.6729 2.5327 2.4231 1.2450 2.1279 1.3780 2.3885 1.1313 1.6465 2.0264 1.6922 1.3906 1.4433 1.3171 1.2538 1.2698 1.7236 3.7500 1.4900 1.3364 1.2396 1.2463 1.2613 1.4500 1.3905 1.4130 4.3325 1.4239 1.2966 1.4030 1.4575 1.5124 1.4211 1.5220 2.5905 1.4766 1.4360 1.4729 1.5963 1.4906 2.9981 1.2854 1.3696 1.1018 1.5803 1.1414 1.0720 1.0879 1.0706 1.1211 1.2220 1.1600 1.0904 1.1313 1.0970 1.0883 1.0981 1.0860 1.1030 1.0541 1.7455 7.2229 2.7583 1.0720 1.0716 1.0706 1.0706 1.0696 1.0691 1.0572 1.0313 1.0614 1.0324 1.0635 1.0597 1.0627 1.0619 1.0616 1.1032 1.0900 1.0917 1.0887 1.0913 1.0954 1.1033 1.0868 1.0995 1.0956 1.1031 1.1042 1.1035 1.1012 1.1020 1.1037 1.0916
irintensity: 0.2398 0.5072 0.1553 1.1128 1.0929 0.1977 1.0139 2.7219 5.3511 2.1460 3.9110 1.7332 1.3292 0.6128 8.2847 5.9153 0.5931 3.5260 0.8001 2.8862 1.0099 6.0837 0.7377 8.2692 9.9738 4.1401 4.6199 3.7953 2.1007 0.2093 18.5889 2.0808 15.6202 0.4110 4.5016 7.4681 8.9464 0.3856 3.2035 1.6014 21.9262 9.4559 1.2740 12.0515 3.8132 47.3795 4.5830 0.1214 0.7350 16.6114 16.6425 0.9950 11.8426 4.0635 3.4739 13.2106 6.1339 40.3445 10.9251 0.5824 51.7564 40.5201 52.1666 14.2365 67.1646 58.8408 13.1371 20.1349 3.2891 28.5310 24.5757 7.7769 34.6429 3.8527 5.0336 6.5300 2.7027 18.4254 9.2564 17.9511 16.7727 0.5421 1.5374 24.6579 7.1318 16.6823 18.5693 73.4496 21.3819 6.6015 1.2016 4.8878 26.8870 35.6778 7.6589 11.6573 28.3381 16.9153 23.9029 0.1667 24.6368 9.0749 0.1797 0.6255 33.4243 2.7888 7.0494 22.4056 7.9961 1.3095 57.3242 13.9462 59.2943 10.4921 69.1759 26.8270 10.4656 13.3780 4.4039 6.0220 36.0620 28.7450 6.5966 27.9359 9.5259 11.4974 7.5328 1.3926 21.4912 15.1920 52.2293 57.3270 138.1418 1681.6692 53.1880 154.9119 162.6314 27.9008 61.6102 24.4822 97.8106 41.2039 67.5708 42.0038 45.9230 24.2807 25.3894 21.3920 9.2792 60.2402 68.9796 5.4775 56.7688 56.7861 19.0495 11.9813 33.3156 3.7724 103.9012 31.8814 71.9669 30.0414 34.0058 22.1979 6.6322
temp: 298.150 k
press: 1.00000 atm
elementType: 8 8 8 7 7 6 6 6 6 6 6 6 6 6 6 6 6 6 6 6 6 6 6 6 6 1 1 1 1 1 1 1 1 1 1 1 1 1 1 1 1 1 1 1 1 1 1 1 1 1 1 1 1 1 1 1 1
symmnumber: 1
zpe: 1292388.3 jmol-1
zpe.correction: 0.492245 hartree
zpe.thermalcorrener: 0.516813 hartree
zpe.thermalcorrenthalpy: 0.517758 hartree
zpe.thermalcorrgfe: 0.437848 hartree
zpe.sumelectzpe: -1114.498800 hartree
zpe.sumelectthermal: -1114.474231 hartree
zpe.sumelectthermalent: -1114.473287 hartree
zpe.sumelectthermalfe: -1114.553196 hartree
dipole: -2.9892 -1.6443 1.3162
dipole: 3.6567
quadrupole: -140.1639 -139.6890 -150.0157
quadrupole: 4.2714 -3.0993 -2.8722
quadrupole: 3.1256 3.6005 -6.7261 4.2714 -3.0993 -2.8722
hfenergy: -1114.9910447 hartree
pointgroup: C01 [X(C20H32N2O3)]
dipole: 0.6168989 1.2615306 0.3126059 debye
polarizability: 275.7462456|-5.1367081|262.198943|15.2787005|-14.2247184|191.4805843 unknown
InChI: InChI=1S/C20H32N2O3/c1-24-18-13-16(14-21-9-5-3-6-10-21)19(23)17(20(18)25-2)15-22-11-7-4-8-12-22/h13,23H,3-12,14-15H2,1-2H3
charge 0 multiplicity 1
57 atoms
O  -0.578187 0.739185 -1.562084
O  3.723518 -0.085451 0.561531
O  2.964566 -2.875127 0.932349
N  0.808471 2.702259 -0.700872
N  -2.541154 -1.613983 -0.122816
C  0.338105 2.912321 0.705839
C  1.074435 3.998186 -1.393554
C  -3.896888 -1.562821 -0.721584
C  -2.487388 -2.508635 1.055887
C  -0.947132 3.760707 0.730696
C  -0.188234 4.882313 -1.412114
C  -0.726908 5.114632 0.018441
C  -4.940531 -1.086389 0.309678
C  -3.4915 -2.065318 2.139785
C  -4.923617 -1.991587 1.562659
C  1.986874 1.765537 -0.765983
C  -1.494574 -1.934804 -1.135296
C  1.567532 0.331027 -0.478738
C  -0.109827 -1.486069 -0.707304
C  0.288338 -0.135388 -0.920203
C  2.448643 -0.571369 0.163928
C  0.8146 -2.369786 -0.10959
C  2.084841 -1.936255 0.321828
C  4.012664 -0.221333 2.008804
C  4.134308 -3.219639 0.094797
H  1.139795 3.414182 1.297855
H  0.156556 1.91896 1.152725
H  1.402339 3.771375 -2.424888
H  1.908076 4.538972 -0.88506
H  -3.865923 -0.8670 -1.580538
H  -4.210453 -2.569096 -1.114737
H  -2.710946 -3.572718 0.763042
H  -1.459883 -2.490791 1.461653
H  -1.257484 3.915902 1.781209
H  -1.757395 3.196618 0.229233
H  -0.965839 4.385658 -2.024856
H  0.052273 5.84497 -1.90193
H  0.004732 5.719082 0.593836
H  -1.668808 5.693295 -0.014928
H  -4.69814 -0.046348 0.602694
H  -5.944842 -1.08126 -0.157136
H  -3.447548 -2.770565 2.992597
H  -3.192027 -1.066582 2.512898
H  -5.632997 -1.61557 2.32469
H  -5.259183 -3.012266 1.282791
H  2.386969 1.834729 -1.797963
H  2.799364 2.075396 -0.078032
H  -1.766247 -1.397537 -2.061109
H  -1.478545 -3.031332 -1.366239
H  0.557233 -3.426309 0.028834
H  -0.184221 1.71619 -1.366885
H  3.936469 -1.276454 2.323856
H  5.040208 0.152789 2.138334
H  3.30794 0.396878 2.598175
H  4.718042 -3.946793 0.68113
H  3.804228 -3.681293 -0.855895
H  4.7434 -2.32149 -0.119536
