program: Gaussian 09
title: 000223218
version: EM64L-G09RevD.01
frameworkgroup: C1[X(C17H28N2O3)]
method: RPBEPBE
basis: SDD
operation: Freq
keyword: #p
keyword: freq=noraman
keyword: PBEPBE/SDD
title: #p freq=noraman PBEPBE/SDD
converged: YES YES NO NO
title: Mulliken charges:
elementType: O O O N N C C C C C C C C C C C C C C C C C H H H H H H H H H H H H H H H H H H H H H H H H H H H H
charge: -0.418590 -0.281100 -0.275248 -0.102162 -0.245219 0.353935 0.346941 -0.092841 -0.481591 -0.503990 0.249383 -0.492262 -0.596618 0.132448 -0.352532 -0.289591 -0.630351 -0.615507 -0.596847 -0.595371 -0.348649 -0.690515 0.224868 0.229854 0.228337 0.244774 0.316052 0.275278 0.228889 0.201594 0.222809 0.215654 0.247466 0.186988 0.220258 0.219738 0.185913 0.226634 0.262504 0.213968 0.233806 0.215915 0.241479 0.233410 0.201571 0.191573 0.416011 0.214859 0.215872 0.210203
chargesum: 0.00000
title: Mulliken charges with hydrogens summed into heavy atoms:
elementType: O O O N N C C C C C C C C C C C C C C C C C
charge: -0.002579 -0.281100 -0.275248 -0.102162 -0.245219 0.353935 0.346941 -0.092841 -0.026868 -0.030880 0.249383 -0.176210 -0.321340 0.132448 0.077952 0.148872 0.024361 0.016778 0.113431 0.095432 0.044495 -0.049580
polarizability: 2.92428599e+02 4.28427512e+00 2.27230172e+02 -7.56882235e+00 1.36524057e+00 1.50755614e+02
1716.lowfreq: -9.2659 -4.7930 -0.0007 -0.0003 0.0004 6.7828 17.4624 24.5224 28.9717
frequency: 16.6452 24.3778 28.9710 53.2328 60.9945 62.9738 69.8195 74.1111 84.9690 106.3395 116.9159 143.4675 144.2897 182.5756 204.7353 217.5131 222.1653 226.9720 229.6310 232.3439 236.8353 248.9950 273.9646 290.7054 307.1902 334.5995 340.5600 351.5146 355.0558 384.8321 407.7023 423.7471 437.3237 441.0161 484.2385 512.5643 553.4757 562.8793 593.0542 644.7554 708.1772 725.7964 744.6994 757.7663 770.9713 806.8907 811.4323 824.2933 873.9554 899.3101 926.7967 937.9051 947.3693 955.9442 966.2329 982.0151 1001.6300 1007.4530 1030.9381 1031.7317 1037.6989 1047.1408 1072.6504 1074.5244 1077.0438 1091.6061 1114.5440 1136.5093 1140.2996 1159.0839 1163.1713 1167.4464 1170.5769 1215.6323 1219.3959 1227.1716 1232.8634 1247.9375 1265.6764 1271.1003 1279.7444 1282.5659 1289.3697 1290.1389 1314.3786 1341.4651 1344.9480 1349.5722 1371.2668 1377.9812 1390.5331 1418.0635 1420.3177 1431.9413 1434.6675 1447.3402 1448.3705 1452.8053 1459.3678 1461.7735 1462.7668 1465.9786 1471.2008 1474.1255 1476.1999 1476.6940 1477.1305 1477.7665 1477.8658 1486.4065 1486.6539 1488.9613 1525.4984 1597.1079 1618.3642 1627.4525 2245.9621 2845.4549 2858.3990 2889.1896 2937.0837 2943.9486 2950.2859 2967.3478 2974.3462 2991.2296 2993.5397 3008.8395 3012.2927 3015.4850 3016.8001 3024.7217 3051.5725 3052.1337 3059.2721 3071.6523 3074.3772 3075.1782 3084.8479 3095.8451 3099.3130 3106.4457 3133.3733 3168.7715
redmass: 3.7783 4.0820 3.1602 2.9405 2.7343 2.5410 4.4031 2.5065 3.0287 3.0650 2.8310 3.4161 4.6782 3.7736 3.4958 1.5380 1.4181 1.3910 1.2851 1.1940 1.0883 2.5531 2.9707 3.1133 2.9471 3.4189 4.5043 2.1511 2.8485 4.1185 2.8826 3.1024 2.8286 2.8160 4.7594 4.2517 4.5792 4.3667 4.8631 5.7796 4.6377 5.5352 1.0982 4.3276 4.6305 1.3455 3.9696 4.6465 6.2567 1.7964 1.4828 1.3991 1.9096 2.6018 2.7669 1.9776 2.1099 1.9173 1.6642 3.4410 1.5467 2.2316 2.2703 2.3673 1.3138 1.2607 2.4580 1.4024 1.4257 2.2545 1.7792 1.9964 2.0578 1.3508 1.3818 1.3267 1.8146 2.2105 2.6590 1.2838 1.5110 1.6632 1.0676 1.1520 3.9289 1.5295 1.4713 2.1459 1.4512 2.9678 1.2193 1.1401 1.1424 1.4105 1.2992 1.8830 1.4389 1.1275 1.0555 1.6648 1.1933 1.0649 1.0680 1.0863 1.0968 1.0465 1.0601 1.0607 1.0668 1.0554 1.0565 1.0860 1.8464 6.0310 6.4071 2.8693 1.0722 1.0571 1.0576 1.0686 1.0472 1.0516 1.0525 1.0582 1.0368 1.0604 1.0879 1.1009 1.0983 1.0717 1.0589 1.0723 1.1024 1.0865 1.0876 1.1007 1.0999 1.1010 1.1006 1.1081 1.1019 1.1019 1.0918 1.0914
irintensity: 0.1823 1.1600 0.2935 0.9593 1.3798 0.6272 1.6262 0.9537 1.1413 1.6412 2.1975 3.6158 2.6377 3.0113 0.5557 0.0839 0.2834 0.4163 0.3995 0.4759 0.3942 1.8566 2.1663 16.8434 1.0278 2.2928 3.7557 10.5082 0.7244 2.8747 7.8801 10.0697 20.1815 34.6075 7.2462 6.8853 8.3707 9.8972 6.9422 25.3524 7.4319 9.5598 7.9486 21.7365 18.1423 1.4168 74.5196 11.6626 3.7122 10.6408 15.9581 19.8687 23.1028 63.9651 22.9410 77.8654 29.8523 2.0262 27.7926 12.4403 21.1811 35.6295 95.8780 22.1466 9.4287 9.8629 36.2992 5.4420 9.7571 219.1683 102.4750 98.8352 141.8900 13.5412 12.5435 8.7544 18.3055 8.7595 9.5765 7.4541 47.2242 4.9675 1.9477 4.2493 303.2879 14.5080 16.0972 24.8886 16.4112 13.7739 10.5784 3.2014 9.8082 19.3626 4.5637 56.7415 48.4752 6.3166 17.3223 34.2487 4.8476 6.7750 0.2166 19.8665 11.9310 10.0108 19.4740 6.2804 9.6035 19.9998 12.9438 16.7459 164.2906 224.2742 110.9324 232.0362 1795.8983 80.8171 187.3095 67.7640 33.9793 33.3742 82.3215 34.4924 33.3536 18.7746 21.5187 16.5423 10.6243 36.1856 68.2442 34.2379 4.3621 23.6868 24.7040 60.8149 56.5300 30.4714 43.2717 39.2266 17.8294 25.6490 3.1821 1.3597
temp: 298.150 k
press: 1.00000 atm
elementType: 8 8 8 7 7 6 6 6 6 6 6 6 6 6 6 6 6 6 6 6 6 6 1 1 1 1 1 1 1 1 1 1 1 1 1 1 1 1 1 1 1 1 1 1 1 1 1 1 1 1
symmnumber: 1
zpe: 1118364.4 jmol-1
zpe.correction: 0.425963 hartree
zpe.thermalcorrener: 0.450969 hartree
zpe.thermalcorrenthalpy: 0.451913 hartree
zpe.thermalcorrgfe: 0.369022 hartree
zpe.sumelectzpe: -998.049975 hartree
zpe.sumelectthermal: -998.024968 hartree
zpe.sumelectthermalent: -998.024024 hartree
zpe.sumelectthermalfe: -998.106916 hartree
dipole: -3.3298 -1.1897 1.9542
dipole: 4.0400
quadrupole: -108.7206 -127.7999 -132.5946
quadrupole: 19.9942 -2.8132 -2.1391
quadrupole: 14.3178 -4.7615 -9.5562 19.9942 -2.8132 -2.1391
hfenergy: -998.4759377 hartree
pointgroup: C01 [X(C17H28N2O3)]
dipole: -1.3137853 0.2752158 -0.8512443 debye
polarizability: 292.3602236|-0.0248726|225.3307207|10.1212348|-11.2370005|152.7234406 unknown
InChI: InChI=1S/C17H28N2O3/c1-6-7-8-22-17(21)13-9-14(11-18(2)3)16(20)15(10-13)12-19(4)5/h9-10,20H,6-8,11-12H2,1-5H3
charge 0 multiplicity 1
50 atoms
O  -3.532114 -0.82299 0.120419
O  2.752134 0.1373 0.818938
O  2.110879 2.349958 0.427397
N  -0.356535 -3.651259 0.440593
N  -4.214546 1.416267 -0.907537
C  -1.17995 -1.282466 0.520521
C  -1.960412 1.04373 0.117898
C  -2.232233 -0.359045 0.253438
C  -1.509987 -2.758722 0.70333
C  -3.128346 2.006667 -0.041706
C  0.423192 0.589472 0.474835
C  0.134276 -0.792276 0.63409
C  -0.63658 1.498053 0.216177
C  1.798446 1.135158 0.56134
C  4.80439 0.624744 -0.512051
C  4.170437 0.587326 0.885651
C  -0.028426 -3.744335 -0.996511
C  -0.519434 -4.980998 1.057967
C  -3.812653 1.357041 -2.341376
C  -5.516787 2.10737 -0.723345
C  6.305587 0.99435 -0.45337
C  6.955038 1.034883 -1.853574
H  -1.830602 -2.922674 1.751947
H  -2.397758 -3.007241 0.07251
H  -2.784947 2.984988 -0.441462
H  -3.59201 2.195243 0.947518
H  0.93814 -1.505601 0.836436
H  -0.396372 2.56227 0.106077
H  4.263161 1.363573 -1.13247
H  4.682346 -0.365418 -0.993107
H  4.207262 1.584612 1.36101
H  4.656058 -0.162851 1.532675
H  0.156713 -2.735866 -1.404132
H  -0.844463 -4.217618 -1.600799
H  0.89085 -4.342488 -1.129838
H  0.39885 -5.575577 0.90108
H  -1.379954 -5.565929 0.642268
H  -0.67437 -4.872103 2.146407
H  -2.842942 0.839892 -2.4274
H  -3.714871 2.372043 -2.783423
H  -4.567212 0.789078 -2.911685
H  -5.463978 3.181228 -1.007457
H  -5.828552 2.035926 0.332712
H  -6.284174 1.618735 -1.347489
H  6.422846 1.982105 0.036689
H  6.843197 0.261556 0.182776
H  -4.079301 -0.003623 -0.31311
H  6.459072 1.785524 -2.496847
H  8.027661 1.295355 -1.793628
H  6.871574 0.053428 -2.357285
