program: Gaussian 09
title: 000223210
version: EM64L-G09RevD.01
frameworkgroup: C1[X(C15H17NO)]
method: RPBEPBE
basis: SDD
operation: Freq
keyword: #p
keyword: freq=noraman
keyword: PBEPBE/SDD
title: #p freq=noraman PBEPBE/SDD
converged: YES YES NO NO
title: Mulliken charges:
elementType: O N C C C C C C C C C C C C C C C H H H H H H H H H H H H H H H H H
charge: -0.425372 -0.105807 0.312627 -0.473884 0.225066 -0.089456 -0.368319 0.260724 -0.394348 -0.256627 -0.630239 -0.617342 -0.402269 -0.451815 -0.223541 -0.222632 -0.241136 0.225192 0.231741 0.281436 0.244974 0.224698 0.247606 0.189838 0.220177 0.220199 0.187869 0.226646 0.251823 0.287782 0.372767 0.228526 0.230454 0.232641
chargesum: 0.00000
title: Mulliken charges with hydrogens summed into heavy atoms:
elementType: O N C C C C C C C C C C C C C C C
charge: -0.052604 -0.105807 0.312627 -0.016951 0.225066 -0.089456 -0.086883 0.260724 -0.149374 -0.031929 0.027383 0.017372 -0.150445 -0.164033 0.004985 0.007821 -0.008495
polarizability: 2.54866453e+02 -1.16181848e+01 1.63404068e+02 1.36561162e+01 8.35421783e+00 1.08781795e+02
1716.lowfreq: -8.7431 -6.2945 -0.4598 -0.0007 -0.0006 -0.0004 23.8778 53.5076 71.8853
frequency: 22.9767 53.2079 71.8462 76.6781 81.2973 133.5419 171.8824 225.5607 229.9688 236.0474 255.2072 283.6348 290.9843 327.4654 349.3285 354.3081 402.2204 427.0310 466.3505 493.7016 530.0905 542.8733 566.8832 574.3472 607.0279 616.6822 700.6553 711.0360 746.4574 766.7952 795.0534 807.1647 815.5712 863.3990 866.1751 921.5940 932.2412 968.7786 982.6842 988.8697 998.3362 998.9285 1019.8198 1034.4027 1037.0768 1065.9538 1071.2786 1084.7429 1091.3224 1136.5023 1159.7439 1167.4184 1173.8760 1192.5776 1198.6857 1209.9246 1256.2722 1267.9972 1292.7135 1303.5375 1315.3196 1354.3618 1369.1286 1380.9444 1418.6894 1426.3941 1437.6232 1446.3097 1457.7163 1460.6294 1464.8404 1474.6284 1477.9764 1485.8994 1490.1318 1578.1731 1594.3468 1609.7754 1616.1553 2850.2191 2862.6237 2893.3358 2994.4408 3016.6484 3024.9154 3075.7202 3084.4911 3121.3093 3126.6859 3128.1060 3139.5825 3141.9075 3149.0378 3160.3109 3165.3121 3497.0239
redmass: 3.3971 3.1568 4.0172 4.5036 3.4670 3.5538 4.6184 1.3688 2.4467 1.1271 3.4254 3.9707 5.0331 3.0535 3.6030 2.4593 2.6306 2.4031 3.4844 1.2317 6.5114 3.2156 3.8819 4.3029 6.0547 6.3264 5.4632 1.9982 2.9232 1.6470 1.6915 5.1504 4.6307 1.2901 3.6440 1.3419 1.3953 1.6128 1.8286 2.8270 1.3192 1.4497 2.8982 1.9174 1.6680 2.0567 2.1468 1.6683 1.2571 1.3989 1.2629 1.8157 1.0539 1.1471 1.8500 2.1120 1.8102 2.2429 1.6062 2.7207 1.4413 1.5474 4.4428 5.3876 1.1404 2.5717 1.3134 2.1672 1.3738 1.0696 1.5822 1.1109 1.0637 1.0620 2.5643 5.6680 6.5266 6.0269 6.8693 1.0568 1.0572 1.0681 1.0885 1.0722 1.0730 1.1010 1.1008 1.0859 1.0865 1.0863 1.0919 1.0915 1.0962 1.0989 1.1016 1.0651
irintensity: 0.2109 0.4431 0.7401 1.3543 0.5013 1.4736 0.2787 0.5170 0.1843 1.1044 2.6325 2.5642 0.9267 8.3941 3.3897 1.0673 5.1673 1.9990 3.8726 114.0458 8.3565 8.2424 4.1579 1.3942 11.3333 0.8961 2.5120 31.8997 10.7614 87.9940 20.1405 23.1318 8.2297 0.3498 4.2470 2.0105 4.5069 3.4397 0.9550 0.4827 1.4551 3.6141 1.6948 37.2192 41.0435 23.4063 23.8185 6.9593 5.3922 7.5209 42.6968 4.7103 0.0971 8.5411 54.3669 12.8876 38.4081 2.4291 23.6603 9.7651 13.1986 3.5968 7.8359 31.1500 3.9978 20.9176 2.3537 44.4171 12.3540 14.3139 1.4019 16.7756 8.0467 12.5349 11.5784 2.6714 8.0664 15.9938 10.5631 81.5357 177.1395 63.0611 21.5284 45.2442 38.4344 30.8964 48.1113 5.2478 4.4705 2.2563 12.8892 1.8172 29.5729 25.3162 24.9704 71.2056
temp: 298.150 k
press: 1.00000 atm
elementType: 8 7 6 6 6 6 6 6 6 6 6 6 6 6 6 6 6 1 1 1 1 1 1 1 1 1 1 1 1 1 1 1 1 1
symmnumber: 1
zpe: 737554.3 jmol-1
zpe.correction: 0.280920 hartree
zpe.thermalcorrener: 0.296769 hartree
zpe.thermalcorrenthalpy: 0.297713 hartree
zpe.thermalcorrgfe: 0.237044 hartree
zpe.sumelectzpe: -710.520527 hartree
zpe.sumelectthermal: -710.504678 hartree
zpe.sumelectthermalent: -710.503734 hartree
zpe.sumelectthermalfe: -710.564403 hartree
dipole: 1.3308 -0.4260 0.6889
dipole: 1.5579
quadrupole: -85.4285 -96.8313 -102.3224
quadrupole: -0.7144 1.1269 3.5886
quadrupole: 9.4322 -1.9706 -7.4616 -0.7144 1.1269 3.5886
hfenergy: -710.801447 hartree
pointgroup: C01 [X(C15H17N1O1)]
dipole: 0.5320019 -0.2734533 0.1337198 debye
polarizability: 255.7731489|-13.8045467|138.6660346|3.8191659|28.5402153|132.6131328 unknown
InChI: InChI=1S/C15H17NO/c1-16(2)11-13-9-6-10-14(15(13)17)12-7-4-3-5-8-12/h3-10,17H,11H2,1-2H3
charge 0 multiplicity 1
34 atoms
O  -0.121328 -1.562204 -0.732777
N  -4.125029 -0.457385 -0.000263
C  -1.698868 0.158374 -0.154153
C  -2.816907 -0.765377 -0.626578
C  0.730213 0.586823 0.168513
C  -0.344809 -0.257189 -0.243364
C  -1.971926 1.447339 0.356262
C  2.150826 0.136955 0.064674
C  0.410385 1.864897 0.696041
C  -0.928359 2.297643 0.786831
C  -4.182573 -0.878984 1.415177
C  -5.260918 -0.984256 -0.780935
C  3.034818 0.272039 1.17084
C  2.664151 -0.417286 -1.144515
C  4.382779 -0.135515 1.075881
C  4.012917 -0.829302 -1.236802
C  4.87726 -0.694216 -0.126428
H  -2.932551 -0.649299 -1.723153
H  -2.506958 -1.825287 -0.4628
H  -3.022743 1.75154 0.414083
H  1.22784 2.527367 1.003047
H  -1.157118 3.293868 1.179848
H  -3.354789 -0.414182 1.977628
H  -4.105791 -1.988904 1.54199
H  -5.134922 -0.545263 1.864999
H  -6.209754 -0.665658 -0.312553
H  -5.274389 -2.101913 -0.853574
H  -5.232153 -0.575285 -1.806801
H  2.65077 0.68342 2.111189
H  2.024468 -0.463204 -2.034222
H  0.840326 -1.797465 -0.64748
H  5.0458 -0.024755 1.941355
H  4.390145 -1.241927 -2.179389
H  5.922686 -1.013708 -0.19797
