program: Gaussian 09
title: 000223209
version: EM64L-G09RevD.01
frameworkgroup: C1[X(C14H23NO2)]
method: RPBEPBE
basis: SDD
operation: Freq
keyword: #p
keyword: freq=noraman
keyword: PBEPBE/SDD
title: #p freq=noraman PBEPBE/SDD
converged: YES YES NO NO
title: Mulliken charges:
elementType: O O N C C C C C C C C C C C C C C H H H H H H H H H H H H H H H H H H H H H H H
charge: -0.456650 -0.443430 -0.286326 0.159262 -0.362939 0.508394 -0.714622 -0.780140 -0.587635 -0.409964 0.337352 -0.717269 -0.576112 0.144260 -0.413558 -0.364729 -0.326188 0.194456 0.195129 0.216181 0.222270 0.206723 0.217721 0.214618 0.223384 0.231058 0.248566 0.211806 0.216594 0.235211 0.213023 0.237393 0.214414 0.285542 0.189396 0.213613 0.357884 0.207477 0.206236 0.331601
chargesum: 0.00000
title: Mulliken charges with hydrogens summed into heavy atoms:
elementType: O O N C C C C C C C C C C C C C C
charge: -0.098766 -0.111829 -0.000785 0.159262 0.026646 0.508394 -0.069448 -0.124417 -0.356577 -0.161398 0.337352 -0.053658 -0.125696 0.144260 -0.199144 0.038280 0.087524
polarizability: 1.95800399e+02 -1.59936145e+01 1.59594798e+02 4.60149125e+00 1.43183121e+01 1.41856254e+02
1716.lowfreq: -8.5581 0.0003 0.0008 0.0008 3.6184 7.4956 21.5696 28.0358 43.1295
frequency: 21.2568 27.7543 43.0244 67.5574 73.6414 110.5584 114.4054 138.5116 163.0723 182.2946 215.2071 216.6194 233.8872 244.6077 269.0558 297.2951 310.0063 318.8502 325.1430 343.5065 349.2030 372.3005 391.8347 416.9739 423.6518 465.9451 478.5323 490.0657 501.7682 576.2562 640.9441 667.1400 707.5696 738.6794 763.7987 771.6092 804.2504 807.8557 811.9401 881.6192 897.0545 920.4522 924.8592 932.1873 941.9416 952.1397 989.0753 1010.2879 1017.7448 1049.2064 1060.3706 1066.5373 1075.3989 1082.7868 1113.7931 1129.0875 1158.7568 1168.0993 1174.5799 1192.9852 1209.3157 1236.3316 1242.3651 1255.4109 1272.7344 1291.0171 1300.4652 1310.9245 1326.3126 1330.3142 1352.5824 1373.4434 1376.6087 1383.9503 1393.6764 1396.6786 1415.9763 1441.4414 1459.3992 1465.5955 1466.4898 1472.2670 1472.7527 1480.0254 1484.6902 1487.7833 1490.3151 1497.0249 1498.9213 1601.7674 1612.6970 2900.2273 2968.5809 2971.5689 2977.4517 2978.1354 2982.3010 2985.7153 2986.7414 3018.0254 3047.0408 3064.8578 3068.7302 3070.5128 3071.3153 3076.2367 3078.2944 3080.9824 3106.8257 3110.8180 3160.8029 3445.5315 3563.9813 3581.9398
redmass: 5.0459 3.6113 4.7870 1.6386 3.2567 3.3917 2.4869 3.6511 2.9315 2.5262 1.2099 2.6314 2.5018 1.4027 2.7197 2.2575 1.1806 1.1894 2.9387 2.1787 1.1959 3.6477 3.2864 3.9254 3.1500 3.5800 3.0738 3.0288 2.9774 3.6108 4.7953 3.2366 1.7964 3.8498 3.2434 1.4336 1.4538 1.7321 1.1921 2.1769 2.0387 1.9665 1.7754 1.4030 1.6690 3.9996 1.2805 1.5060 2.3944 1.6585 1.9229 2.2015 2.1154 1.9623 1.9375 2.5966 1.4775 2.1472 1.3461 2.3410 2.5398 1.9624 2.6315 1.3396 1.1941 1.2954 1.4205 1.3991 1.4366 1.2251 1.2580 1.3894 3.3899 1.3137 1.2288 1.2027 3.6272 1.0896 1.0618 1.1645 1.0789 1.0700 1.0750 1.0466 1.0573 1.0562 1.0955 2.5099 1.0593 6.5225 6.6325 1.0660 1.0537 1.0388 1.0367 1.0825 1.0373 1.0605 1.0719 1.1007 1.1029 1.0997 1.0994 1.1022 1.0990 1.0993 1.0988 1.0998 1.0895 1.0896 1.0933 1.0737 1.0662 1.0660
irintensity: 0.2776 0.0912 1.3167 5.4712 0.1851 4.1230 0.1669 3.3528 1.7544 0.3199 0.1136 1.9964 0.5836 0.0326 5.7991 10.2168 170.1933 1.6144 4.9603 9.1817 107.3822 5.8964 11.3578 6.6069 26.7269 5.5447 2.1431 3.1914 2.3242 13.5693 7.2670 1.6165 151.7007 3.2776 43.7669 22.2475 34.5491 12.5746 1.1622 5.8354 7.0209 5.0341 4.5362 1.8621 2.1751 71.5641 1.6083 13.8017 31.9186 2.7550 2.9523 13.3193 13.7850 147.0552 32.2159 89.3452 28.5403 14.3691 5.2672 7.7567 2.4073 1.2938 25.0796 5.4507 2.4605 23.9695 24.0710 1.0183 4.1833 3.9367 11.3138 16.0630 24.2271 4.4235 23.6930 13.3017 4.9518 7.9177 0.3422 27.6839 1.8534 6.4331 7.7462 8.8664 9.3884 15.7247 1.7485 78.6312 3.3323 2.3082 6.5421 57.9885 13.9880 57.1913 39.2074 31.6201 26.6666 30.0284 77.7699 24.5865 16.0851 6.8515 51.2163 41.3917 24.4521 66.3495 55.2037 52.6467 30.1990 8.0220 11.1213 2.4117 6.1235 31.7134
temp: 298.150 k
press: 1.00000 atm
elementType: 8 8 7 6 6 6 6 6 6 6 6 6 6 6 6 6 6 1 1 1 1 1 1 1 1 1 1 1 1 1 1 1 1 1 1 1 1 1 1 1
symmnumber: 1
zpe: 905163.0 jmol-1
zpe.correction: 0.344758 hartree
zpe.thermalcorrener: 0.364189 hartree
zpe.thermalcorrenthalpy: 0.365133 hartree
zpe.thermalcorrgfe: 0.296364 hartree
zpe.sumelectzpe: -751.123925 hartree
zpe.sumelectthermal: -751.104495 hartree
zpe.sumelectthermalent: -751.103551 hartree
zpe.sumelectthermalfe: -751.172319 hartree
dipole: -2.6413 -1.1776 -0.0649
dipole: 2.8927
quadrupole: -114.3006 -96.5567 -104.2284
quadrupole: -5.9435 3.9944 14.3912
quadrupole: -9.2720 8.4719 0.8002 -5.9435 3.9944 14.3912
hfenergy: -751.4686832 hartree
pointgroup: C01 [X(C14H23N1O2)]
dipole: -1.0701218 0.3347626 -0.1949126 debye
polarizability: 192.6355021|16.9379209|166.3379658|1.2357583|14.5097018|138.2779828 unknown
InChI: InChI=1S/C14H23NO2/c1-4-14(2,3)12-5-6-13(17)11(9-12)10-15-7-8-16/h5-6,9,15-17H,4,7-8,10H2,1-3H3
charge 0 multiplicity 1
40 atoms
O  1.305882 2.970826 0.645799
O  4.384934 -2.027932 1.91615
N  3.079042 0.723671 -0.330039
C  -2.778236 -0.969861 -0.608165
C  -2.197067 -2.408558 -0.37364
C  -1.725272 0.101293 -0.237635
C  -3.129756 -0.83131 -2.121669
C  -4.091388 -0.808782 0.200181
C  -0.44525 0.084719 -0.860665
C  -1.9709 1.131064 0.702598
C  0.56313 1.030525 -0.581365
C  -1.770175 -2.727373 1.075109
C  1.940831 0.976324 -1.246619
C  0.271814 2.042064 0.373159
C  -0.984181 2.09739 1.008932
C  3.03775 -0.555957 0.406317
C  4.393148 -0.804243 1.09655
H  -2.963615 -3.139467 -0.704202
H  -1.326673 -2.553146 -1.04435
H  -2.238608 -0.971403 -2.760222
H  -3.546685 0.16902 -2.339104
H  -3.87918 -1.591525 -2.414006
H  -4.798633 -1.611654 -0.078614
H  -4.582931 0.157903 -0.016129
H  -3.924593 -0.872324 1.290308
H  -0.21424 -0.695259 -1.597871
H  -2.935707 1.193841 1.213807
H  -1.328148 -3.738999 1.136017
H  -2.627332 -2.699492 1.771971
H  -1.014869 -2.00577 1.435726
H  1.936793 0.187062 -2.022713
H  2.143344 1.938083 -1.753715
H  -1.200038 2.884937 1.743688
H  3.204823 1.525494 0.303658
H  2.847111 -1.365434 -0.329801
H  2.229368 -0.621495 1.172523
H  0.995806 3.660174 1.283549
H  4.613954 0.002331 1.817593
H  5.199776 -0.823084 0.335722
H  4.23507 -2.807354 1.323764
