program: Gaussian 09
title: 000223176
version: EM64L-G09RevD.01
frameworkgroup: C1[X(C4H10S8)]
method: RPBEPBE
basis: SDD
operation: Freq
keyword: #pfreq=noraman
keyword: PBEPBE/SDD
title: #p freq=noraman PBEPBE/SDD
converged: YES YES NO NO
title: Mulliken charges:
elementType: S S S S S S S S C C C C H H H H H H H H H H
charge: 0.119219 0.134746 0.109062 0.165000 0.156615 0.071883 -0.181225 -0.133343 -0.924102 -0.786433 -0.808003 -0.833503 0.340469 0.297681 0.278486 0.280462 0.312078 0.291948 0.273957 0.266243 0.293646 0.275114
chargesum: 0.00000
title: Mulliken charges with hydrogens summed into heavy atoms:
elementType: S S S S S S S S C C C C
charge: 0.119219 0.134746 0.109062 0.165000 0.156615 0.071883 -0.181225 -0.133343 -0.583633 0.070196 0.069980 0.001500
polarizability: 3.17150153e+02 2.28344400e+00 2.27126667e+02 8.09528769e+00 1.45860704e+01 1.96416867e+02
1716.lowfreq: -9.6601 -3.3155 -0.0024 0.0018 0.0027 3.4877 16.5632 24.3039 34.5364
frequency: 16.0948 24.1262 34.5218 38.8560 54.0575 61.0605 72.2618 82.0065 106.5902 123.6913 133.4372 158.0887 164.4711 169.9409 176.2503 187.7738 203.8600 210.3155 226.7498 231.4072 237.3116 252.7511 304.4228 326.7837 408.1064 468.2636 474.7329 593.3535 598.3027 600.7912 620.8177 633.8780 722.4799 970.8311 972.7114 974.1495 980.4355 989.3494 996.3909 1103.1917 1231.0260 1330.8442 1340.9538 1342.9641 1424.2540 1426.5152 1430.4380 1431.6649 1436.7781 1455.0664 2537.7189 3002.9338 3015.5710 3023.9374 3122.7766 3147.3665 3154.7856 3159.4964 3162.6254 3173.6350
redmass: 8.8035 8.9676 7.2557 6.8391 7.3904 6.0790 9.9842 5.3021 10.6377 4.8376 4.0303 1.2642 1.1811 1.3636 3.9408 2.3073 5.6185 5.4082 4.8048 8.2918 9.3761 10.4034 22.6749 19.4051 23.6092 22.0573 21.8930 7.6270 9.4055 8.5844 9.0910 7.0731 10.9749 1.2104 1.2295 1.1971 1.1804 1.2347 1.2223 1.0545 1.0473 1.1264 1.1239 1.1239 1.0509 1.0509 1.0512 1.0511 1.0515 1.0543 1.0763 1.0285 1.0267 1.0262 1.1028 1.1061 1.1057 1.1061 1.1063 1.1062
irintensity: 2.4108 2.0861 1.0955 1.3685 0.9074 0.7341 0.7454 1.8323 0.8723 8.4412 4.1400 4.1209 0.2614 0.5109 0.7522 0.3604 1.4259 0.5704 0.8358 3.1272 7.9699 5.7982 0.8224 6.7374 3.0029 11.3098 31.2989 1.0899 3.0493 0.6164 10.1578 0.8333 39.5516 7.0134 16.4373 5.0891 8.4880 8.0825 8.2213 2.0257 11.7555 9.1499 1.8134 3.1905 31.1668 0.9145 13.9028 5.9017 7.3620 15.2565 9.7500 13.5226 7.1342 7.0686 4.4851 11.6199 1.0707 1.1620 0.5517 0.8758
temp: 298.150 k
press: 1.00000 atm
elementType: 16 16 16 16 16 16 16 16 6 6 6 6 1 1 1 1 1 1 1 1 1 1
symmnumber: 1
zpe: 359214.5 jmol-1
zpe.correction: 0.136818 hartree
zpe.thermalcorrener: 0.157433 hartree
zpe.thermalcorrenthalpy: 0.158377 hartree
zpe.thermalcorrgfe: 0.082458 hartree
zpe.sumelectzpe: -3341.862273 hartree
zpe.sumelectthermal: -3341.841657 hartree
zpe.sumelectthermalent: -3341.840713 hartree
zpe.sumelectthermalfe: -3341.916632 hartree
dipole: -2.1107 1.6224 1.9111
dipole: 3.2771
quadrupole: -131.8646 -124.3538 -136.8012
quadrupole: -19.2687 -11.6141 -1.5187
quadrupole: -0.8581 6.6527 -5.7947 -19.2687 -11.6141 -1.5187
hfenergy: -3341.9990903 hartree
pointgroup: C01 [X(C4H10S8)]
dipole: 0.4334133 1.1002785 0.5137114 debye
dipolederiv: -0.220178 -0.2305641 0.0701635 0.035839 0.0749315 0.0256384 0.0060902 -0.0597236 -0.1544483 -0.2931327 0.0474793 0.118543 -0.0543988 -0.1913032 -0.0988904 -0.0299288 -0.0784052 -0.3235326 0.2657604 -0.2460093 0.2221611 -0.2305878 0.3168876 -0.1993779 0.2847991 -0.2914861 0.5127421 -0.0939154 -0.071204 -0.0224858 -0.2375898 0.1846115 0.1324419 -0.1166171 0.1178152 0.4352509 -0.3502781 0.5590261 -0.1921708 0.2885129 -0.1087372 0.0762367 0.0257044 0.195229 -0.0131971 0.0351938 -0.0077963 0.034507 -0.090466 -0.1310994 0.0810614 -0.1486675 0.0377465 -0.0932056 -0.404873 0.293789 -0.2362775 0.08076 -0.3167023 0.0558714 -0.0788475 0.2477391 -0.3840986 0.0041652 0.0081963 -0.1041904 0.2147573 -0.1192257 -0.0697603 0.1296192 -0.0555536 -0.2647012 0.7994974 -0.2963454 0.1707954 0.0058449 0.0428407 0.00036 -0.0894629 -0.0649841 -0.0042032 -0.0436751 -0.0181704 -0.0190683 0.0217679 0.0048524 0.0063076 -0.060156 0.0234502 -0.079505 -0.1219938 0.0076483 -0.0181881 0.0365929 -0.0048863 -0.0165258 0.0210514 0.0691411 -0.016076 0.0741813 0.0207751 -0.0249802 -0.0016325 -0.0230862 -0.0269589 0.0132449 -0.1521027 0.0538527 -0.1009274 0.0046916 0.0341731 -0.0104918 0.0115114 0.0175727 0.037628 -0.005547 0.0176216 -0.012269 -0.0058506 0.037808 -0.0489056 0.0790166 -0.0041132 0.0060846 -0.0065985 0.0627541 0.1018099 0.0102268 0.013382 0.0063808 -0.06077 -0.0002199 0.0186304 0.015562 0.0564742 0.0593164 0.0064546 -0.061303 0.0167585 0.0811958 0.0168579 -0.0531579 -0.0365692 0.0011994 0.0721485 0.0162827 -0.0347166 0.0013907 0.025715 0.0121436 -0.0604115 -0.0141146 0.0735582 0.0901267 0.0052778 0.0533169 -0.0137492 0.0279092 0.0184232 0.0771013 0.0450143 0.0165702 0.134213 0.0176899 -0.0259582 -0.0423168 -0.0239858 -0.0261745 -0.0514197 -0.0501816 0.0219516 0.0412676 -0.0898246 -0.0198646 -0.0332854 0.0379719 -0.0862362 -0.0170603 -0.1065533 0.0349866 0.0063358 0.029311 -0.0265011 0.0768268 -0.0101589 0.04796 0.0105415 0.0734732 0.0772229 -0.0427734 -0.0610838 0.0308544 -0.0220081 0.1025115 0.0373824 0.0752342 0.096649 -0.0312169 unknown
polarizability: 230.9640812|-15.4039114|303.1708118|21.2145734|-31.7739672|206.5587936 unknown
InChI: InChI=1S/C2H4S4.2CH3S2/c1-5-6-2(3)4;2*1-3-2/h2H,1H3;2*1H3
charge 0 multiplicity 1
22 atoms
S  -1.372203 -0.652466 -0.177568
S  1.503908 0.076345 0.899002
S  -1.044745 1.54042 -1.417067
S  3.265419 0.126239 -1.048308
S  0.328793 -2.79555 1.012111
S  0.07662 -4.285655 -0.68375
S  -2.542868 1.912972 -2.925865
S  2.408507 -1.270402 -2.462895
C  0.424139 -1.124652 0.067345
C  -1.609943 2.605889 0.055064
C  2.768412 1.825269 -1.734634
C  -1.804822 -4.347283 -0.82196
H  0.88925 -1.383096 -0.938942
H  -2.646059 2.331179 0.292591
H  -1.543736 3.654467 -0.269816
H  -0.929053 2.382579 0.888951
H  1.684406 1.824603 -1.915291
H  3.328122 1.972217 -2.669731
H  3.050819 2.570893 -0.975945
H  -2.014429 -5.056004 -1.641524
H  -2.186682 -3.346641 -1.074621
H  -2.242356 -4.714222 0.117051
