program: Gaussian 09
title: 000223164
version: EM64L-G09RevD.01
frameworkgroup: C1[X(C15H11ClN2)]
method: RPBEPBE
basis: SDD
operation: Freq
keyword: #p
keyword: freq=noraman
keyword: PBEPBE/SDD
title: #p freq=noraman PBEPBE/SDD
converged: YES YES NO NO
title: Mulliken charges:
elementType: Cl N N C C C C C C C C C C C C C C C H H H H H H H H H H H
charge: -0.053242 -0.508098 -0.040238 0.246737 0.349764 -0.023615 -0.351420 0.470340 -0.327706 -0.289462 -0.261728 -0.379888 -0.094326 -0.442902 -0.387263 -0.195864 -0.214814 -0.255485 0.306085 0.210932 0.262024 0.288337 0.257161 0.239019 0.231243 0.272019 0.229418 0.229831 0.233141
chargesum: 0.00000
title: Mulliken charges with hydrogens summed into heavy atoms:
elementType: Cl N N C C C C C C C C C C C C C C C
charge: -0.053242 -0.202013 -0.040238 0.246737 0.349764 -0.023615 -0.140488 0.470340 -0.065682 -0.001124 -0.004567 -0.140869 -0.094326 -0.211659 -0.115244 0.033554 0.015017 -0.022344
polarizability: 3.41978645e+02 1.81447070e+00 1.84997384e+02 -3.12659243e-01 9.46352387e+00 8.85630345e+01
1716.lowfreq: -8.2659 -2.9913 0.0018 0.0023 0.0024 3.5305 34.1357 44.3505 68.1114
frequency: 34.1113 44.2937 68.1062 93.2314 147.0635 156.4291 224.5777 235.2798 245.9490 271.8730 336.6726 364.4257 408.1958 419.3578 443.8667 476.6070 498.7061 519.7785 523.0094 568.5616 590.5333 613.8941 615.7776 635.5204 657.2335 694.3176 744.3528 764.1597 770.1045 800.5940 818.5543 829.1669 845.9811 851.6677 879.7145 898.3170 907.6029 941.3346 956.7231 971.2247 985.1180 989.5999 1022.4805 1044.0094 1061.6995 1084.8604 1101.0631 1162.6307 1173.0978 1189.5641 1208.9776 1236.3885 1251.9411 1291.5748 1324.0816 1336.8933 1355.0373 1377.7286 1393.3478 1414.5445 1436.3747 1439.2001 1481.7217 1489.5514 1524.9998 1554.1798 1580.2612 1599.1204 1609.6420 1615.5969 3118.8841 3121.3975 3124.2207 3133.8807 3145.6223 3161.4404 3172.6277 3174.2344 3183.7104 3184.2700 3544.1222
redmass: 6.0370 4.5273 4.9108 6.8908 4.1847 6.7882 9.0344 4.9318 5.3737 5.7773 4.5659 8.2458 2.9227 3.1544 3.4261 2.0898 3.3535 5.4049 1.9644 7.7677 6.8284 6.3831 5.6782 3.7194 6.0370 2.1453 2.4977 1.9795 2.5295 3.6030 2.2873 1.6226 4.9126 1.2911 5.4766 1.5039 1.4210 1.3471 1.4061 1.3816 5.7100 1.3025 2.5208 2.9305 1.8636 1.7264 2.2662 1.3885 1.0508 1.1199 2.1488 1.6269 2.1132 2.1506 1.7756 1.8210 3.0418 4.1133 4.6111 3.4909 2.5119 2.5269 2.2804 2.7526 3.7965 5.2193 5.7587 4.9614 6.1898 6.1062 1.0880 1.0890 1.0904 1.0866 1.0929 1.0951 1.1006 1.0952 1.0937 1.0934 1.0749
irintensity: 0.5934 0.6282 0.4346 1.0874 0.7474 1.5448 0.6506 2.0158 0.5688 3.5204 3.2863 9.9865 0.7391 5.9591 15.4169 86.4161 9.1938 2.4836 54.3871 15.2819 4.2162 2.6181 1.2099 10.3424 6.6205 38.1578 53.0065 49.3268 6.8150 5.0737 28.2638 16.1028 65.5305 21.8705 24.3008 27.2056 2.7359 0.2553 2.3665 0.1466 0.2326 0.4246 4.7505 2.6747 14.6120 18.3292 22.3842 6.1812 0.4048 6.3885 24.4235 1.9443 10.2868 11.1950 24.0718 41.9829 80.5683 5.2391 103.9197 19.6981 6.8035 85.5338 16.6992 162.1539 244.1062 293.8274 242.2009 27.7227 97.8871 55.5666 12.2169 11.2545 25.4806 1.5340 23.2202 31.1594 8.5209 3.6639 9.3389 1.0088 14.9343
temp: 298.150 k
press: 1.00000 atm
elementType: 17 7 7 6 6 6 6 6 6 6 6 6 6 6 6 6 6 6 1 1 1 1 1 1 1 1 1 1 1
symmnumber: 1
zpe: 575801.9 jmol-1
zpe.correction: 0.219311 hartree
zpe.thermalcorrener: 0.233519 hartree
zpe.thermalcorrenthalpy: 0.234463 hartree
zpe.thermalcorrgfe: 0.176905 hartree
zpe.sumelectzpe: -1146.541811 hartree
zpe.sumelectthermal: -1146.527604 hartree
zpe.sumelectthermalent: -1146.526660 hartree
zpe.sumelectthermalfe: -1146.584218 hartree
dipole: 4.6732 -2.5246 -0.1841
dipole: 5.3147
quadrupole: -113.3089 -105.7342 -114.2725
quadrupole: 3.0900 -0.0598 4.5748
quadrupole: -2.2036 5.3710 -3.1673 3.0900 -0.0598 4.5748
hfenergy: -1146.7611228 hartree
pointgroup: C01 [X(C15H11Cl1N2)]
dipole: 1.89828 -0.8637326 -0.1505392 debye
polarizability: 341.1166568|11.6698161|183.0908733|1.1705179|18.7527854|91.3315342 unknown
InChI: InChI=1S/C15H11ClN2/c16-11-6-7-13-14(8-9-17-15(13)10-11)18-12-4-2-1-3-5-12/h1-10,18H
charge 0 multiplicity 1
29 atoms
Cl -5.777619 -1.432321 0.050568
N  1.086449 -0.586419 -0.307618
N  -2.126471 2.25456 -0.046897
C  -1.316801 -0.113354 -0.092733
C  0.057939 0.353382 -0.170717
C  -2.36722 0.885309 -0.055987
C  -1.683983 -1.49606 -0.040932
C  2.483139 -0.413292 -0.102271
C  0.278515 1.745483 -0.15071
C  -3.736581 0.464844 -0.01727
C  -3.023912 -1.8931 0.003165
C  -0.831425 2.632769 -0.084404
C  -4.036219 -0.892281 0.002343
C  3.37839 -1.22558 -0.850533
C  3.007379 0.484825 0.866649
C  4.769664 -1.136466 -0.638649
C  4.401795 0.574802 1.060197
C  5.292845 -0.229084 0.311733
H  0.814796 -1.497827 -0.678938
H  -0.918068 -2.27923 0.004047
H  1.285131 2.158559 -0.239202
H  -4.507452 1.238943 0.000545
H  -3.297721 -2.950441 0.05236
H  -0.649417 3.714335 -0.082911
H  2.981607 -1.916611 -1.60487
H  2.332032 1.079885 1.487798
H  5.445432 -1.769608 -1.224037
H  4.792079 1.267995 1.813684
H  6.373499 -0.154318 0.470192
