program: Gaussian 09
title: 000217762
version: EM64L-G09RevD.01
frameworkgroup: C1[X(C17H18ClN)]
method: RPBEPBE
basis: SDD
operation: Freq
keyword: #p
keyword: freq=noraman
keyword: PBEPBE/SDD
title: #p freq=noraman PBEPBE/SDD
converged: YES YES NO NO
title: Mulliken charges:
elementType: Cl N C C C C C C C C C C C C C C C C C H H H H H H H H H H H H H H H H H H
charge: -0.066817 -0.625277 0.115913 -0.542358 -0.568432 -0.109937 -0.452494 0.434572 0.432032 -0.422106 -0.361712 -0.396067 -0.415664 -0.225943 -0.230898 -0.240512 -0.252084 -0.115152 -0.247267 0.236534 0.213269 0.244053 0.220814 0.244738 0.211543 0.229536 0.266064 0.263420 0.245609 0.248314 0.243652 0.241578 0.251675 0.252143 0.225073 0.223874 0.228312
chargesum: 0.00000
title: Mulliken charges with hydrogens summed into heavy atoms:
elementType: Cl N C C C C C C C C C C C C C C C C C
charge: -0.066817 -0.095793 0.115913 -0.092555 -0.103565 0.134802 -0.011415 0.434572 0.432032 -0.176497 -0.113398 -0.152415 -0.174086 0.025732 0.021246 -0.015440 -0.028210 -0.115152 -0.018955
polarizability: 2.38092201e+02 8.42680534e+00 1.85490488e+02 1.51221557e+01 8.03892807e+00 1.52237832e+02
1716.lowfreq: -0.0014 -0.0003 0.0019 5.3150 7.4252 14.7718 28.6770 43.2917 48.5827
frequency: 28.4501 42.4263 48.4354 68.2581 84.0842 115.4875 146.4306 181.4951 203.6793 227.8073 240.6146 263.8918 295.9154 327.0168 347.2785 350.1712 405.1151 407.8473 427.5960 442.4145 483.0998 508.0055 531.1739 580.2448 592.4673 617.8948 627.6907 660.6625 693.9663 708.0509 713.6393 722.1166 769.8544 792.1300 827.7154 830.4693 843.8445 853.6217 860.5444 917.4748 946.3594 957.3306 962.0244 968.5123 976.6541 981.8442 991.1661 993.8120 1000.0331 1007.7007 1029.5412 1033.2593 1071.0450 1076.2570 1100.7511 1111.0823 1128.8295 1138.2691 1172.5466 1184.5488 1190.7293 1196.1893 1199.2087 1223.4355 1227.2983 1244.2277 1265.6991 1292.5270 1300.9283 1307.9693 1323.6727 1353.6307 1360.9988 1370.0798 1376.2028 1391.4721 1434.0144 1465.5785 1468.0681 1477.5825 1482.6405 1490.5905 1581.8453 1588.9354 1596.7808 1610.4025 1642.1540 2901.7242 2992.9667 2998.9235 3015.2196 3052.5174 3061.1035 3076.5232 3117.5332 3124.8634 3133.1273 3138.4997 3149.0344 3150.3499 3163.7735 3166.6479 3170.8402 3426.7857 3550.8100
redmass: 3.9090 4.3366 4.9921 4.3574 3.8785 3.2249 4.9216 3.6547 1.3324 4.9605 3.4400 3.9974 3.1478 3.7374 3.6505 3.1604 2.8384 2.9075 3.9705 4.2594 2.4435 3.2821 2.7749 3.3541 3.9866 6.3600 6.8151 1.3485 5.7668 1.6772 3.9248 3.3515 1.8989 1.4953 1.5465 1.3274 2.8694 1.2841 2.7518 1.4889 1.5621 2.3258 2.1328 1.4046 1.4055 1.7393 5.2982 1.3417 3.9457 2.0397 2.3467 1.9630 2.5286 2.4275 1.8931 1.6589 2.0515 2.0100 1.0505 1.4830 1.3606 1.1178 1.3841 1.4414 1.9706 1.7588 1.3358 1.3768 1.2978 1.3650 1.3516 1.6351 4.4984 1.4840 7.1931 3.3968 2.2359 1.1322 1.0858 2.2956 1.8787 1.1558 7.3345 6.0558 6.1551 6.0315 1.0953 1.0832 1.0583 1.0588 1.0626 1.1033 1.1044 1.1043 1.0856 1.0866 1.0891 1.0925 1.0879 1.0941 1.1007 1.0954 1.0968 1.0450 1.0963
irintensity: 0.0404 0.0968 0.0668 0.3123 0.6964 0.2865 1.6237 1.5326 31.3051 1.4511 3.9604 2.8449 2.9540 0.8630 3.4144 4.9714 0.3385 0.0598 5.3382 11.1925 25.9759 6.2318 15.7200 26.2471 4.8467 0.3652 0.5567 163.5620 8.9236 43.7718 29.7107 4.1199 40.9037 9.3028 40.3635 9.5327 5.2293 0.0333 4.2003 2.8316 0.6161 4.6228 2.6804 0.1288 0.3136 2.7883 0.0799 0.5361 45.7505 14.1053 2.0418 3.4475 14.0578 29.2884 2.5459 14.3859 8.0554 2.5184 0.0134 3.8312 2.4330 0.6622 1.4403 2.2735 1.3011 6.8356 5.4705 2.2135 0.4054 8.3486 3.2070 2.4226 3.9081 30.2933 2.1396 6.3810 6.6355 14.1072 2.0977 93.8620 23.2050 8.7750 1.9602 1.6574 2.9139 9.8208 43.7051 66.9746 29.2505 36.7142 28.8581 4.0867 21.7749 59.8321 6.0755 0.3311 7.0861 23.3544 5.0266 38.0683 21.0899 8.4833 1.6364 2.6946 0.1193
temp: 298.150 k
press: 1.00000 atm
elementType: 17 7 6 6 6 6 6 6 6 6 6 6 6 6 6 6 6 6 6 1 1 1 1 1 1 1 1 1 1 1 1 1 1 1 1 1 1
symmnumber: 1
zpe: 798356.3 jmol-1
zpe.correction: 0.304078 hartree
zpe.thermalcorrener: 0.321028 hartree
zpe.thermalcorrenthalpy: 0.321972 hartree
zpe.thermalcorrgfe: 0.258289 hartree
zpe.sumelectzpe: -1172.043497 hartree
zpe.sumelectthermal: -1172.026547 hartree
zpe.sumelectthermalent: -1172.025602 hartree
zpe.sumelectthermalfe: -1172.089286 hartree
dipole: 3.7059 0.1104 -0.2581
dipole: 3.7165
quadrupole: -124.0440 -118.4448 -112.0944
quadrupole: -0.1482 1.7196 3.1621
quadrupole: -5.8496 -0.2504 6.1000 -0.1482 1.7196 3.1621
hfenergy: -1172.3475748 hartree
pointgroup: C01 [X(C17H18Cl1N1)]
dipole: -1.4599399 -0.0409318 0.0699174 debye
polarizability: 238.0841576|-2.2807953|182.0480095|18.3358532|-11.233575|155.6883547 unknown
InChI: InChI=1S/C17H18ClN/c18-15-8-6-14(7-9-15)17(11-10-16(19)12-17)13-4-2-1-3-5-13/h1-9,16H,10-12,19H2
charge 0 multiplicity 1
37 atoms
Cl 5.674897 0.468436 0.063617
N  -2.768896 -3.288439 1.221115
C  -0.420432 -0.653665 -0.089338
C  -1.001734 -1.525948 1.068495
C  -0.713142 -1.592782 -1.314931
C  -2.34522 -2.057803 0.513953
C  -2.048349 -2.334543 -0.99472
C  1.091247 -0.36973 0.010173
C  -1.191207 0.6914 -0.143886
C  1.924498 -0.933205 1.00821
C  1.69759 0.466879 -0.966648
C  -0.970032 1.646411 0.885972
C  -2.124901 1.016168 -1.159131
C  3.317318 -0.682844 1.034475
C  3.083814 0.724966 -0.963891
C  -1.658079 2.877136 0.904268
C  -2.814901 2.251693 -1.149008
C  3.877011 0.140301 0.042805
C  -2.587621 3.187686 -0.116991
H  -1.110816 -0.968906 2.01704
H  -0.356129 -2.407016 1.246347
H  0.113203 -2.322898 -1.38134
H  -0.729523 -1.047195 -2.27509
H  -3.10195 -1.241987 0.58477
H  -2.880138 -1.990698 -1.635928
H  -1.932967 -3.423767 -1.142147
H  -3.581955 -3.742914 0.788186
H  -2.925876 -3.144021 2.226014
H  1.500097 -1.574838 1.786124
H  1.073201 0.93536 -1.73602
H  -0.237978 1.425805 1.672573
H  -2.324399 0.308188 -1.970108
H  3.948732 -1.121376 1.812885
H  3.536545 1.369378 -1.723125
H  -1.465449 3.596689 1.708321
H  -3.530063 2.479788 -1.947875
H  -3.121198 4.144689 -0.108467
