program: Gaussian 09
title: 000223166
version: EM64L-G09RevD.01
frameworkgroup: C1[X(C16H22ClN3)]
method: RPBEPBE
basis: SDD
operation: Freq
keyword: #p
keyword: freq=noraman
keyword: PBEPBE/SDD
title: #p freq=noraman PBEPBE/SDD
converged: YES YES NO NO
title: Mulliken charges:
elementType: Cl N N N C C C C C C C C C C C C C C C C H H H H H H H H H H H H H H H H H H H H H H
charge: -0.065737 -0.336511 -0.389002 -0.052391 -0.062958 -0.344822 -0.369293 -0.424623 -0.426559 -0.684917 -0.696151 0.364906 0.269583 -0.023977 -0.328430 -0.345882 -0.297618 -0.383933 -0.275749 -0.093642 0.187367 0.192423 0.205849 0.206757 0.231892 0.205699 0.230151 0.243816 0.221838 0.226585 0.199689 0.217104 0.219170 0.208524 0.218314 0.212820 0.335715 0.219103 0.214861 0.285276 0.231061 0.253690
chargesum: 0.00000
title: Mulliken charges with hydrogens summed into heavy atoms:
elementType: Cl N N N C C C C C C C C C C C C C C C C
charge: -0.065737 -0.092694 -0.053287 -0.052391 0.124409 0.053450 0.069357 0.011228 0.021864 -0.048954 -0.056494 0.364906 0.269583 -0.023977 -0.109328 -0.131021 -0.012342 -0.152872 -0.022058 -0.093642
polarizability: 2.53626650e+02 2.26490187e+01 2.59187009e+02 -1.92295621e+01 6.24486725e+00 1.26983443e+02
1716.lowfreq: -12.9722 -6.7904 -5.9493 0.0022 0.0025 0.0029 13.7619 20.4524 21.4523
frequency: 11.0141 20.0755 21.3058 42.4215 55.7419 75.5808 105.3265 123.0106 136.8940 156.4593 182.3130 198.0012 211.8539 228.2655 242.1713 251.6493 269.7094 291.0184 303.5203 336.4726 376.9916 401.6728 421.9464 432.6615 449.1648 468.2860 497.9021 506.6882 562.3430 590.5334 605.5843 631.4977 639.2236 643.8169 710.6580 728.8217 762.0641 779.8152 809.6107 817.2594 819.8321 832.5919 861.4102 867.5334 895.8392 906.1149 917.0196 935.7257 938.4837 949.2481 956.5975 966.0199 971.3350 1023.9171 1058.5133 1060.9679 1074.8223 1095.8182 1129.4513 1133.6148 1144.0571 1149.9073 1170.7766 1179.7142 1205.8985 1210.7474 1218.5945 1246.3618 1256.4478 1274.0508 1292.2154 1315.1175 1327.8627 1332.5046 1339.0732 1345.3976 1349.8231 1368.7056 1371.9694 1381.0723 1391.7869 1395.4103 1415.2271 1440.4359 1441.6350 1463.2804 1464.6714 1466.2681 1471.1121 1478.0916 1479.7821 1483.7753 1487.9069 1494.2858 1533.2593 1553.1290 1585.4946 1608.5014 2874.0541 2891.5590 2944.8990 2966.3340 2971.1568 2981.6075 2996.8715 3013.5652 3017.8369 3045.2365 3058.7836 3066.2349 3073.6916 3075.2050 3078.3039 3114.4947 3127.9362 3165.1201 3172.0384 3182.2988 3397.8016 3488.9871
redmass: 3.0600 4.4190 4.5802 3.5780 3.9350 5.0915 3.1849 4.3951 3.0964 2.1601 3.5942 1.1400 2.0907 1.4080 3.1162 4.8854 4.1980 2.8431 3.6531 3.3565 3.3310 3.1748 2.8170 2.1629 3.9219 3.4645 3.2997 4.3194 4.5334 3.0599 3.1406 4.1375 2.1826 3.3291 1.9085 1.6951 1.9119 1.7728 1.8102 2.6639 1.7281 4.2940 3.9341 3.0437 1.5005 1.3322 1.2337 1.3498 1.6012 1.4097 1.7074 2.1510 1.7669 2.8482 2.7558 1.8986 1.8090 2.2890 2.3083 2.5626 2.1144 1.8430 1.8613 1.7745 1.7285 1.5914 1.4711 1.4204 1.2528 1.1595 1.2706 2.6415 1.6547 1.4436 1.5543 1.4145 1.5186 1.5800 1.4215 1.3249 4.3952 1.2761 2.7276 2.4080 1.2087 1.0637 1.0867 1.0507 2.0525 1.0706 1.0599 1.1844 1.0591 1.0939 4.5041 3.9201 6.3398 6.9309 1.0695 1.0710 1.0823 1.0365 1.0362 1.0626 1.0905 1.0877 1.0629 1.0987 1.0986 1.0990 1.0996 1.1039 1.0991 1.0895 1.0883 1.0934 1.0954 1.0932 1.0736 1.0757
irintensity: 0.3020 0.4087 0.7486 0.1618 0.7129 0.1665 2.0957 0.9904 3.8834 3.4431 1.5085 0.7048 1.1174 0.1273 0.6109 1.3658 0.3834 0.1009 0.5977 2.3666 3.2824 0.5458 6.7427 0.9118 4.4968 5.0287 0.9664 7.2369 13.3074 8.7156 23.1494 17.9265 31.1875 21.6835 43.4677 48.8179 16.4366 25.7081 53.6095 4.8262 14.1875 34.4251 48.8176 28.1055 23.8428 0.5824 7.2796 0.8291 1.6655 1.5062 2.8277 1.3359 2.1052 12.5103 18.9499 9.8634 8.0131 11.2054 15.7732 26.5835 27.0296 17.5191 4.7103 5.5756 0.6592 28.1974 11.1265 0.4903 1.1019 22.6376 2.9352 9.1935 28.6608 3.0300 3.5809 9.6280 22.3281 9.0273 13.4503 10.9813 63.4151 7.5817 11.9112 50.2839 39.2786 4.8917 7.7556 1.0502 48.5895 9.4639 7.1321 18.9829 33.9072 15.4571 72.4969 130.5428 423.2659 69.7445 85.4069 125.3661 19.7274 38.0712 26.9278 45.6131 33.4041 32.0310 33.7961 45.4981 17.9449 76.2207 28.6275 45.4398 60.2782 31.5388 8.7019 27.5315 4.9476 0.6847 1.0522 151.3478
temp: 298.150 k
press: 1.00000 atm
elementType: 17 7 7 7 6 6 6 6 6 6 6 6 6 6 6 6 6 6 6 6 1 1 1 1 1 1 1 1 1 1 1 1 1 1 1 1 1 1 1 1 1 1
symmnumber: 1
zpe: 923113.8 jmol-1
zpe.correction: 0.351595 hartree
zpe.thermalcorrener: 0.372053 hartree
zpe.thermalcorrenthalpy: 0.372997 hartree
zpe.thermalcorrgfe: 0.299000 hartree
zpe.sumelectzpe: -1245.714350 hartree
zpe.sumelectthermal: -1245.693893 hartree
zpe.sumelectthermalent: -1245.692949 hartree
zpe.sumelectthermalfe: -1245.766946 hartree
dipole: -8.4506 -0.9426 0.3940
dipole: 8.5121
quadrupole: -133.5040 -122.5151 -131.1433
quadrupole: 3.5096 0.8265 0.3375
quadrupole: -4.4499 6.5390 -2.0892 3.5096 0.8265 0.3375
hfenergy: -1246.0659459 hartree
pointgroup: C01 [X(C16H22Cl1N3)]
dipole: -3.2141204 0.8440675 -0.4151284 debye
polarizability: 243.7282338|-19.8730251|265.6424502|28.9560612|-3.5698659|130.4264176 unknown
InChI: InChI=1S/C16H22ClN3/c1-12(2)11-18-7-3-8-19-15-6-9-20-16-10-13(17)4-5-14(15)16/h4-6,9-10,12,18-19H,3,7-8,11H2,1-2H3
charge 0 multiplicity 1
42 atoms
Cl 3.814232 -3.74429 0.783919
N  -3.390878 0.592865 0.059662
N  -0.616179 1.337622 -0.854104
N  3.362837 1.42712 0.754561
C  -4.385215 -1.69539 -0.288997
C  -3.857298 -0.650741 0.724762
C  -2.819997 1.599774 0.992089
C  -2.307537 2.856044 0.250601
C  -1.498367 2.496582 -1.030207
C  -3.268038 -2.186183 -1.238017
C  -5.037685 -2.878943 0.462811
C  0.663254 1.375308 -0.333366
C  1.389865 0.133148 -0.090487
C  2.726153 0.225144 0.462509
C  1.335615 2.583564 -0.029263
C  0.850836 -1.161388 -0.372892
C  3.457962 -0.978695 0.728557
C  2.65537 2.548435 0.494016
C  1.576588 -2.328845 -0.112048
C  2.880109 -2.210654 0.445435
H  -5.171342 -1.203141 -0.903398
H  -4.652941 -0.446105 1.483602
H  -2.996487 -1.082305 1.275239
H  -3.540691 1.911284 1.786328
H  -1.97055 1.116686 1.511919
H  -3.15347 3.509433 -0.044583
H  -1.684515 3.438728 0.955213
H  -4.151086 1.002367 -0.506322
H  -0.916112 3.367775 -1.37778
H  -2.203242 2.241327 -1.841007
H  -2.48623 -2.723965 -0.665717
H  -3.667697 -2.882804 -1.997849
H  -2.794211 -1.336936 -1.762348
H  -4.2970 -3.387235 1.109959
H  -5.433361 -3.628572 -0.246275
H  -5.873543 -2.54151 1.103975
H  -1.142281 0.458298 -0.836039
H  0.855424 3.55396 -0.178986
H  -0.143308 -1.271139 -0.821163
H  4.461938 -0.881555 1.148678
H  3.161896 3.4944 0.724194
H  1.160883 -3.314971 -0.336679
