program: Gaussian 09
title: 000223190
version: EM64L-G09RevD.01
frameworkgroup: C1[X(C19H31NO3)]
method: RPBEPBE
basis: SDD
operation: Freq
keyword: #p
keyword: freq=noraman
keyword: PBEPBE/SDD
title: #p freq=noraman PBEPBE/SDD
converged: NO YES NO NO
title: Mulliken charges:
elementType: O O O N C C C C C C C C C C C C C C C C C C C H H H H H H H H H H H H H H H H H H H H H H H H H H H H H H H
charge: -0.237978 -0.479610 -0.445438 -0.260079 0.120294 -0.408651 0.299891 0.614037 -0.725236 -0.776595 -0.732203 -0.726836 -0.719028 -0.726106 0.408645 -0.569990 -0.504893 -0.103975 0.159450 -0.325300 -0.333379 -0.327286 -0.322811 0.188038 0.190809 0.215002 0.225646 0.206619 0.216414 0.218609 0.215450 0.206957 0.211329 0.210875 0.204045 0.204465 0.233595 0.198243 0.217423 0.230178 0.232807 0.272059 0.224436 0.238012 0.219430 0.249450 0.226234 0.216422 0.204557 0.228050 0.226099 0.198823 0.411715 0.381286
chargesum: 0.00000
title: Mulliken charges with hydrogens summed into heavy atoms:
elementType: O O O N C C C C C C C C C C C C C C C C C C C
charge: -0.237978 -0.067896 -0.064152 -0.260079 0.120294 -0.029804 0.299891 0.614037 -0.077969 -0.126122 -0.103042 -0.084731 -0.073184 -0.493300 0.408645 -0.297931 -0.042444 -0.103975 0.159450 0.143580 0.109277 0.105320 0.102111
polarizability: 2.77969161e+02 -1.37971034e+00 2.02471766e+02 -1.41964008e+00 1.40021544e+01 1.92309773e+02
1716.lowfreq: -5.1251 -2.9629 -0.0008 -0.0007 0.0006 16.0486 22.6225 38.7510 46.3057
frequency: 22.3645 38.6953 46.2714 62.1754 63.6626 70.4578 134.0007 135.7550 162.5934 179.0014 189.2535 204.0927 226.8205 234.4821 239.8364 247.0035 255.4490 256.8101 267.5757 273.2342 288.7846 293.1429 308.5770 319.5653 343.7247 355.9054 357.7695 366.0599 376.7055 409.2960 417.2551 431.7059 450.3016 453.9819 471.9029 493.0680 517.2152 528.2703 532.2849 538.5077 580.6747 604.5415 647.8914 665.3944 727.7919 733.2755 743.7680 773.7709 808.9599 814.5286 841.9150 860.1059 864.5935 884.7320 893.2369 898.0744 918.5855 923.3802 929.0265 937.0522 942.6931 977.1218 979.8610 993.0844 1004.8020 1013.9741 1024.2810 1026.9002 1032.6812 1050.8079 1079.4293 1088.4758 1094.8116 1114.4559 1116.9898 1126.8415 1143.8594 1152.2103 1185.8321 1194.1641 1196.8232 1211.6142 1214.2927 1219.4636 1240.0343 1250.6851 1260.2981 1271.4977 1279.5708 1294.9734 1310.6901 1321.5070 1336.6152 1340.3082 1342.3209 1353.6341 1362.6181 1369.2516 1371.3265 1373.4877 1376.4480 1378.7564 1397.3967 1402.7521 1446.5960 1448.9224 1451.8739 1452.6986 1456.0357 1458.0402 1458.4219 1462.5701 1464.7037 1465.8779 1468.7240 1471.3053 1479.2450 1482.0394 1487.2338 1489.0618 1496.7810 1498.4004 1502.9003 1615.2787 1633.0242 2395.9003 2931.5712 2937.0717 2943.2147 2950.5862 2952.2626 2959.7829 2960.7531 2968.4827 2969.4004 2975.0922 2980.1804 3001.0811 3006.2163 3041.3839 3052.7690 3055.1251 3058.4051 3058.5050 3063.6737 3065.9288 3068.6402 3076.0363 3082.6411 3085.6640 3087.4434 3092.4604 3096.7452 3112.2775 3176.5543 3483.3093
redmass: 4.2260 4.0030 2.6938 5.1687 4.2328 3.2947 3.7156 4.7723 2.7616 2.6374 3.5989 1.3951 2.1293 2.0276 2.8011 1.6790 1.4917 2.0154 1.9080 1.1226 2.2451 2.5951 3.0204 2.9370 2.9554 2.4215 1.8999 1.6456 1.9515 1.9989 2.5814 2.4703 2.8082 4.4968 2.8413 2.8104 2.3045 2.3083 2.9620 2.0013 3.5763 2.3729 4.3564 3.9270 4.3225 3.2913 4.2535 3.5575 3.6454 2.9238 1.5903 1.6264 2.0174 1.6581 2.3109 2.3209 1.8755 1.7438 1.5817 1.2365 1.8272 1.7754 2.3414 2.3920 1.3955 3.1303 1.5660 2.0874 1.4126 1.8567 3.1630 2.0540 2.7816 1.9750 1.8650 2.5408 1.7494 1.4455 1.4357 2.4268 1.1596 2.9937 1.2427 2.8444 1.6708 3.0052 1.7036 1.4579 1.2769 1.3462 1.6112 1.3783 1.9226 1.4261 1.4370 1.4536 2.2272 1.6194 1.2774 1.3288 1.2047 1.2684 1.2208 1.2050 1.4849 1.1577 1.0930 1.0762 1.0939 1.0623 1.0882 1.0537 1.3503 1.1447 1.1253 1.0813 1.0707 1.0611 1.2275 1.8666 1.1040 1.6170 1.0718 4.1832 6.2225 1.0674 1.0663 1.0655 1.0650 1.0596 1.0665 1.0663 1.0352 1.0349 1.0370 1.0381 1.0362 1.1000 1.0985 1.0955 1.0995 1.0951 1.0990 1.0995 1.0996 1.0982 1.0995 1.0996 1.0994 1.0976 1.0956 1.0970 1.0955 1.0902 1.0902 1.0644
irintensity: 0.2699 0.2360 0.0247 1.1341 0.5139 0.3375 1.8257 1.8935 3.4923 2.0667 7.6031 0.1803 1.8980 3.0306 0.1287 1.1852 0.6591 1.6647 0.2213 0.0869 1.7510 1.7614 1.4208 3.5176 0.6041 9.7234 0.1359 0.3607 3.8647 0.7259 1.2109 16.1670 2.9695 15.5992 2.4965 1.9501 25.4687 39.0917 12.4543 72.4017 2.9137 1.8313 6.3425 3.5230 15.2560 12.4417 30.0832 21.8649 39.1723 10.2703 0.2590 24.9099 1.6122 8.2004 20.3442 13.0085 13.8310 5.0677 7.1448 0.2217 9.5029 7.0347 22.1681 6.9170 1.0803 13.1669 3.1029 16.9825 0.3265 36.0816 24.2069 27.7099 16.8209 7.9121 31.9651 10.1433 12.0766 27.6408 141.2538 4.5594 10.9380 68.0296 7.8275 57.6006 15.6504 10.2454 48.1111 13.4621 9.7718 5.6160 22.9574 13.7697 65.8610 30.7208 37.6520 16.0222 21.7408 17.7503 5.8638 2.7994 18.0826 35.7935 22.3818 14.8576 47.9331 11.3538 5.3422 5.9436 27.1617 3.8337 7.3466 0.2425 12.1702 4.8124 0.2791 12.9981 22.4864 18.6172 57.5583 117.2182 32.8499 105.1295 20.9620 27.5040 14.2478 1476.1658 20.5366 29.2019 33.0023 30.1426 45.6283 68.2114 47.7005 43.4999 45.4638 25.7419 31.2813 17.3815 30.2339 31.1968 5.1718 16.6094 29.9103 26.9076 33.2899 104.1768 73.4710 47.4960 49.7856 18.9329 32.2735 22.3702 36.0573 15.9501 3.0402 62.6948
temp: 298.150 k
press: 1.00000 atm
elementType: 8 8 8 7 6 6 6 6 6 6 6 6 6 6 6 6 6 6 6 6 6 6 6 1 1 1 1 1 1 1 1 1 1 1 1 1 1 1 1 1 1 1 1 1 1 1 1 1 1 1 1 1 1 1
symmnumber: 1
zpe: 1228046.8 jmol-1
zpe.correction: 0.467738 hartree
zpe.thermalcorrener: 0.491909 hartree
zpe.thermalcorrenthalpy: 0.492853 hartree
zpe.thermalcorrgfe: 0.415445 hartree
zpe.sumelectzpe: -1021.211533 hartree
zpe.sumelectthermal: -1021.187362 hartree
zpe.sumelectthermalent: -1021.186418 hartree
zpe.sumelectthermalfe: -1021.263826 hartree
dipole: 1.5233 2.4189 2.7816
dipole: 3.9886
quadrupole: -135.7301 -153.4612 -139.7581
quadrupole: -5.0247 6.2748 -2.5153
quadrupole: 7.2530 -10.4781 3.2250 -5.0247 6.2748 -2.5153
hfenergy: -1021.679271 hartree
pointgroup: C01 [X(C19H31N1O3)]
dipole: 0.6339954 -0.9195297 -1.1022675 debye
polarizability: 277.519419|6.1756876|203.0541631|-1.1259336|13.8888169|192.177117 unknown
InChI: InChI=1S/C19H31NO3/c1-18(2,3)13-19(4,5)15-10-14(17(22)16(21)11-15)12-20-6-8-23-9-7-20/h10-11,21-22H,6-9,12-13H2,1-5H3
charge 0 multiplicity 1
54 atoms
O  5.481203 -1.465448 0.448055
O  2.320364 1.978266 0.603961
O  0.199081 3.117559 1.907457
N  3.179993 -0.087702 -0.670538
C  -3.098372 0.402559 -0.760081
C  -3.298135 -1.159275 -0.762662
C  -3.335978 -2.027088 0.546861
C  -1.649871 0.811792 -0.383932
C  -3.346458 0.875097 -2.232391
C  -4.154776 1.115534 0.122322
C  -3.138609 -3.505371 0.09576
C  -4.713228 -1.942687 1.265077
C  -2.209682 -1.670566 1.551874
C  -0.5451 0.23987 -1.07136
C  0.787402 0.617402 -0.785841
C  -1.381875 1.791598 0.607608
C  1.978199 0.080424 -1.566201
C  1.029177 1.576376 0.228436
C  -0.060898 2.165317 0.913539
C  3.017923 -1.242978 0.270385
C  4.454946 -0.2166 -1.438691
C  4.229087 -1.32053 1.211538
C  5.640785 -0.323626 -0.464216
H  -4.24915 -1.356689 -1.303016
H  -2.5003 -1.582644 -1.406371
H  -2.674483 0.358317 -2.941863
H  -3.165165 1.961469 -2.32541
H  -4.390195 0.668032 -2.537523
H  -4.131507 2.208679 -0.044296
H  -5.16692 0.758243 -0.140391
H  -4.001109 0.934507 1.200038
H  -2.136479 -3.65383 -0.349906
H  -3.894162 -3.796697 -0.659362
H  -3.23538 -4.194646 0.956009
H  -5.537503 -2.199765 0.572086
H  -4.745667 -2.659422 2.108276
H  -4.913347 -0.939213 1.674408
H  -2.232954 -2.37184 2.408752
H  -1.212815 -1.735965 1.078606
H  -2.317821 -0.646341 1.948079
H  -0.715615 -0.509897 -1.853638
H  -2.185503 2.273635 1.169352
H  1.725045 -0.874193 -2.076916
H  2.275806 0.808027 -2.34856
H  2.929019 -2.191153 -0.305081
H  2.088204 -1.094988 0.848517
H  4.574371 0.676474 -2.080109
H  4.425004 -1.117495 -2.091943
H  4.275953 -0.408891 1.845916
H  4.170406 -2.211525 1.856678
H  6.580565 -0.507197 -1.009633
H  5.732236 0.617595 0.120909
H  2.954633 1.244953 0.163745
H  1.187961 3.223035 1.965588
