program: Gaussian 09
title: 000223162
version: EM64L-G09RevD.01
frameworkgroup: C1[X(C14H18ClN3O)]
method: RPBEPBE
basis: SDD
operation: Freq
keyword: #p
keyword: freq=noraman
keyword: PBEPBE/SDD
title: #p freq=noraman PBEPBE/SDD
converged: YES YES NO NO
title: Mulliken charges:
elementType: Cl O N N N C C C C C C C C C C C C C C H H H H H H H H H H H H H H H H H H
charge: -0.061003 -0.440383 -0.416780 -0.307425 -0.048537 -0.473315 -0.337565 -0.356242 0.376785 0.269321 -0.354579 -0.026309 -0.320607 -0.338200 -0.329352 -0.294659 -0.386758 -0.274207 -0.089955 0.214806 0.201138 0.224171 0.245829 0.204417 0.212620 0.295503 0.244737 0.208765 0.202854 0.232739 0.195001 0.208160 0.207634 0.286489 0.233489 0.254463 0.336955
chargesum: 0.00000
title: Mulliken charges with hydrogens summed into heavy atoms:
elementType: Cl O N N N C C C C C C C C C C C C C C
charge: -0.061003 -0.103428 -0.121276 -0.062687 -0.048537 -0.057372 0.132436 0.060794 0.376785 0.269321 0.057039 -0.026309 -0.087868 -0.143199 0.086442 -0.008170 -0.153269 -0.019744 -0.089955
polarizability: 2.51381250e+02 4.96782961e+01 1.55030359e+02 9.04393153e+00 -2.55980663e+01 1.77478484e+02
1716.lowfreq: -1.0495 -0.0025 -0.0022 -0.0020 5.1541 8.6437 13.2720 18.8482 41.3682
frequency: 12.9858 18.2348 41.3390 57.8742 68.5809 77.0514 111.8796 122.9632 133.6868 169.5230 186.1915 213.9572 231.6760 244.1780 280.2284 281.4832 306.9719 338.7387 363.0960 374.3303 389.5966 418.4767 431.7869 481.5803 502.9781 512.7458 535.4594 577.2698 615.8476 641.1438 642.9235 681.9866 743.6101 758.0035 805.1869 807.2814 816.7372 824.6703 839.0881 867.8645 878.4804 897.4352 929.5210 929.8277 950.4212 961.6471 996.1888 1031.0447 1053.0147 1061.5840 1062.4442 1068.6364 1097.6344 1103.1042 1117.4652 1149.2085 1161.1714 1178.5726 1207.5422 1215.9606 1242.8923 1244.5383 1273.6255 1285.7722 1292.0899 1312.1199 1331.0289 1332.5079 1344.5297 1356.0490 1369.6877 1376.0289 1391.5394 1394.8017 1414.9194 1440.3966 1450.7241 1465.2565 1472.2714 1477.1513 1481.9033 1489.3150 1493.7343 1532.5164 1559.6633 1585.0066 1609.9381 2878.8142 2899.2457 2944.9305 2975.9027 2980.5618 2996.5134 3009.2962 3027.7721 3039.1324 3065.3022 3118.1817 3118.3581 3173.7190 3176.2098 3181.8931 3423.1388 3563.7456 3566.5313
redmass: 6.4097 6.7931 4.9720 1.7933 5.0978 4.3642 4.1578 3.6579 3.5127 2.7379 2.8720 4.2239 3.2263 4.8914 5.3907 5.0323 1.1690 2.5074 2.4603 2.4981 4.3556 2.7935 2.2404 3.8097 3.3143 4.6777 3.2844 7.6378 5.8835 3.4223 6.2678 1.3079 4.8758 1.7984 1.5572 1.9180 1.3641 1.7476 3.2132 4.3553 2.8415 1.4985 1.8360 1.3544 1.4139 3.2048 2.8913 2.3017 2.6528 1.8012 1.9451 2.0136 2.2362 2.2856 1.5302 3.5692 1.3795 2.0155 1.9842 1.2831 1.4064 1.4371 1.1820 1.1738 1.2416 2.0542 1.8548 1.3631 1.5550 1.5179 1.3480 2.0026 3.8046 1.4226 2.6289 2.4771 1.2178 1.7093 1.0968 1.3149 1.1023 1.0874 1.0863 5.1132 3.6970 6.5025 6.6303 1.0710 1.0679 1.0655 1.0637 1.0640 1.0902 1.0898 1.0952 1.0981 1.1027 1.0900 1.0878 1.0951 1.0933 1.0933 1.0740 1.0758 1.0663
irintensity: 1.0845 0.2547 0.4762 2.7743 1.0607 2.2552 5.2625 1.3014 0.6962 3.8376 4.8487 5.5838 0.7400 0.0885 8.5828 1.3939 122.7286 34.9006 22.0611 36.2124 10.0581 14.8684 60.7443 4.9710 8.3047 5.3963 1.1365 11.8915 0.5029 8.3884 5.8447 97.3887 3.5270 18.0540 26.0809 21.3571 27.8476 25.9599 27.7721 47.2824 4.1490 24.6480 4.1460 0.1628 1.1346 61.0069 26.2835 25.8742 3.0211 14.5257 9.8772 12.1960 16.7153 1.4570 32.8626 80.1777 11.8406 5.1763 2.9361 54.0458 2.1665 0.2076 3.6992 0.7582 0.8789 13.5924 24.1935 23.4533 41.6259 2.6050 8.9572 4.6155 78.5138 3.2469 8.4394 46.3158 40.6936 47.4429 5.1172 4.6024 6.7857 64.5826 9.3273 56.0985 126.9792 350.7068 78.2806 82.2238 108.1601 49.6990 56.3233 61.4246 22.9797 12.5696 32.9868 57.7275 49.8557 31.5112 15.6448 4.8592 19.5140 0.8655 1.1940 22.7929 7.9816
temp: 298.150 k
press: 1.00000 atm
elementType: 17 8 7 7 7 6 6 6 6 6 6 6 6 6 6 6 6 6 6 1 1 1 1 1 1 1 1 1 1 1 1 1 1 1 1 1 1
symmnumber: 1
zpe: 787976.4 jmol-1
zpe.correction: 0.300124 hartree
zpe.thermalcorrener: 0.319153 hartree
zpe.thermalcorrenthalpy: 0.320097 hartree
zpe.thermalcorrgfe: 0.249539 hartree
zpe.sumelectzpe: -1242.391873 hartree
zpe.sumelectthermal: -1242.372844 hartree
zpe.sumelectthermalent: -1242.371900 hartree
zpe.sumelectthermalfe: -1242.442458 hartree
dipole: -4.7255 -1.1330 -4.6365
dipole: 6.7165
quadrupole: -147.9910 -120.3001 -116.8398
quadrupole: 11.7147 5.1030 0.4526
quadrupole: -19.6140 8.0768 11.5372 11.7147 5.1030 0.4526
hfenergy: -1242.6919972 hartree
pointgroup: C01 [X(C14H18Cl1N3O1)]
dipole: 1.949854 0.6609605 -1.656471 debye
polarizability: 243.3226646|55.3925492|162.5785552|-4.305408|28.6709278|177.9888736 unknown
InChI: InChI=1S/C14H18ClN3O/c15-11-2-3-12-13(4-7-18-14(12)10-11)17-6-1-5-16-8-9-19/h2-4,7,10,16-17,19H,1,5-6,8-9H2
charge 0 multiplicity 1
37 atoms
Cl -5.603021 -2.333713 -0.891594
O  5.759492 -2.145103 2.164045
N  0.446058 1.084706 -1.020148
N  4.141614 0.184941 -0.341865
N  -2.675175 0.90477 1.91624
C  2.720008 1.473005 -1.924139
C  1.663755 1.899337 -0.885674
C  3.361317 0.105348 -1.595232
C  -0.562413 1.026999 -0.076118
C  -1.746112 0.207018 -0.303909
C  4.579335 -1.10981 0.223389
C  -2.767382 0.193396 0.724317
C  -0.494528 1.744094 1.14126
C  -1.94832 -0.581085 -1.480353
C  5.224371 -0.894886 1.607179
C  -3.949908 -0.592725 0.527509
C  -1.55534 1.641718 2.080945
C  -3.105899 -1.345598 -1.66042
C  -4.097033 -1.332574 -0.639855
H  3.510189 2.248424 -1.962389
H  2.271785 1.439933 -2.939177
H  1.425187 2.978977 -0.997056
H  2.099822 1.745542 0.119346
H  3.967771 -0.236618 -2.469304
H  2.563701 -0.648507 -1.445439
H  0.283753 0.655239 -1.930514
H  4.931485 0.839969 -0.435905
H  5.301171 -1.665322 -0.422162
H  3.681268 -1.751584 0.332505
H  0.356773 2.388402 1.371975
H  -1.1936 -0.615722 -2.275738
H  4.492376 -0.415794 2.288984
H  6.106829 -0.235589 1.525136
H  -4.705027 -0.581654 1.317256
H  -1.488902 2.202371 3.021818
H  -3.252135 -1.946928 -2.561747
H  5.008335 -2.759773 2.360733
