program: Gaussian 09
title: 000223314
version: EM64L-G09RevD.01
frameworkgroup: C1[X(C19H12O2)]
method: RPBEPBE
basis: SDD
operation: Freq
keyword: #pfreq=noraman
keyword: PBEPBE/SDD
title: #p freq=noraman PBEPBE/SDD
converged: NO YES NO NO
title: Mulliken charges:
elementType: O O C C C C C C C C C C C C C C C C C C C H H H H H H H H H H H H
charge: -0.258385 -0.198992 0.027283 0.207729 0.408132 0.423496 0.132522 -0.404831 -0.442294 -0.475183 -0.373102 0.342343 0.050181 -0.420414 -0.234123 -0.235610 -0.367419 -0.394437 -0.236203 -0.242241 -0.237505 0.257524 0.238792 0.241585 0.283234 0.243859 0.235816 0.232086 0.275226 0.232960 0.229634 0.227163 0.231174
chargesum: 0.00000
title: Mulliken charges with hydrogens summed into heavy atoms:
elementType: O O C C C C C C C C C C C C C C C C C C C
charge: -0.258385 -0.198992 0.027283 0.207729 0.408132 0.423496 0.132522 -0.147307 -0.203502 -0.233598 -0.089868 0.342343 0.050181 -0.176555 0.001693 -0.003524 -0.092193 -0.161477 -0.006569 -0.015078 -0.006331
polarizability: 4.42180696e+02 1.62331428e+00 2.14373739e+02 1.61911246e+00 4.89597318e+00 8.71963535e+01
1716.lowfreq: -3.2264 -0.0003 -0.0001 0.0003 3.8776 6.9037 31.6547 49.4967 80.2381
frequency: 31.6350 49.4868 80.2380 87.7385 122.7898 158.1207 174.5444 211.3829 244.3760 266.3013 302.0310 361.9258 387.0795 403.1720 413.1480 426.3274 428.8331 473.3926 505.0773 516.1360 529.2975 572.8720 573.3093 611.8415 619.6000 647.6962 681.1688 688.0870 697.7456 726.1211 749.5575 764.3778 768.5298 783.7206 800.6284 826.8312 831.2145 848.2733 881.9577 892.7606 919.1763 932.5240 965.4473 975.3231 980.8670 981.9931 988.7075 997.1582 1002.4394 1021.9691 1031.7454 1053.7623 1088.2850 1094.8947 1150.6669 1175.3877 1175.5077 1194.1177 1201.1419 1224.8840 1235.9861 1270.2674 1300.6710 1317.9624 1349.3323 1363.7494 1380.9601 1409.7393 1424.8638 1436.6901 1442.9430 1463.9374 1485.1255 1507.4184 1560.8910 1580.8692 1593.9627 1603.1239 1611.4268 1631.7286 1664.8998 3123.4956 3126.6039 3128.9833 3132.6978 3136.4776 3142.1402 3146.3064 3152.8133 3158.8819 3162.4644 3174.7774 3185.3474
redmass: 6.2835 3.8983 6.0825 5.6758 5.3132 5.2718 5.5918 5.3720 6.6845 4.8348 5.7588 5.0414 5.5983 2.8664 4.5176 3.8027 5.7081 6.1533 3.5134 7.4073 3.8616 3.5462 6.2047 6.8875 7.0175 7.1040 4.1169 6.1128 1.7802 4.0976 5.7700 1.2917 4.9859 2.5570 3.4085 1.4153 6.8021 1.2774 5.3824 1.5879 1.4056 1.5019 1.3682 1.4126 1.5438 4.8371 4.9681 1.3864 1.3379 3.1310 2.1974 2.6027 1.9598 2.0122 1.3481 1.0619 1.0722 2.0605 1.1444 1.6893 1.9858 1.9336 2.8012 1.5310 1.8289 3.0335 5.8950 4.8253 2.7317 2.3326 5.3310 2.9788 2.3528 3.8357 7.8708 5.5945 6.4269 6.2077 6.0559 7.1382 11.8373 1.0853 1.0868 1.0869 1.0888 1.0906 1.0903 1.0940 1.0980 1.0953 1.0994 1.0988 1.0955
irintensity: 1.1421 0.3834 0.6225 0.6346 0.9811 0.9060 0.3271 0.6854 2.1127 0.6865 1.2868 0.7709 1.0880 0.1348 0.7132 3.8152 1.2488 13.4117 5.7997 5.6743 7.2400 8.3791 6.3173 4.7421 5.4491 19.5425 8.8461 2.0819 53.5456 2.8932 4.4346 49.4495 22.3526 43.0953 0.9745 74.9208 44.4519 0.9882 19.6434 1.2132 20.3612 7.1023 2.2681 4.0206 5.3761 22.9549 0.1756 0.1741 0.1136 7.0776 3.8167 8.0501 24.4985 6.2734 1.7586 0.0031 0.1042 2.0875 8.8562 1.6907 2.1239 9.8489 34.6947 13.7846 0.1148 51.4637 3.5670 3.6007 3.8878 13.1210 0.8716 28.5655 1.7128 21.4695 35.8708 0.7647 10.0460 26.7472 9.8878 92.6110 350.6619 6.7739 1.9631 0.4713 8.7615 7.7993 12.3544 29.3519 22.9631 28.7055 38.5153 18.6867 6.9305
temp: 298.150 k
press: 1.00000 atm
elementType: 8 8 6 6 6 6 6 6 6 6 6 6 6 6 6 6 6 6 6 6 6 1 1 1 1 1 1 1 1 1 1 1 1
symmnumber: 1
zpe: 656168.8 jmol-1
zpe.correction: 0.249922 hartree
zpe.thermalcorrener: 0.265320 hartree
zpe.thermalcorrenthalpy: 0.266264 hartree
zpe.thermalcorrgfe: 0.206665 hartree
zpe.sumelectzpe: -880.291727 hartree
zpe.sumelectthermal: -880.276328 hartree
zpe.sumelectthermalent: -880.275384 hartree
zpe.sumelectthermalfe: -880.334983 hartree
dipole: 1.5995 4.2015 -0.4430
dipole: 4.5174
quadrupole: -93.1446 -115.7704 -125.9844
quadrupole: -4.4504 0.9827 2.9911
quadrupole: 18.4885 -4.1373 -14.3513 -4.4504 0.9827 2.9911
hfenergy: -880.5416481 hartree
pointgroup: C01 [X(C19H12O2)]
dipole: 0.6219831 1.6071954 0.4345519 debye
polarizability: 442.1112575|1.0325325|194.8165645|5.0590299|46.1584376|106.8229667 unknown
InChI: InChI=1S/C19H12O2/c20-19-17(13-6-2-1-3-7-13)12-15-11-10-14-8-4-5-9-16(14)18(15)21-19/h1-12H
charge 0 multiplicity 1
33 atoms
O  0.565263 -1.274374 -0.418607
O  -1.404506 -2.383266 -0.787479
C  1.303033 -0.143382 -0.0889
C  2.731858 -0.265955 -0.104145
C  0.647909 1.065279 0.236106
C  3.509208 0.908799 0.228322
C  -1.568353 -0.03247 -0.0865
C  -0.791075 1.080956 0.22034
C  1.449429 2.217524 0.557937
C  2.835439 2.140682 0.555143
C  3.393883 -1.490996 -0.43226
C  -3.056707 0.02472 -0.056292
C  -0.897797 -1.294662 -0.45443
C  4.936192 0.807112 0.219687
C  4.790593 -1.554916 -0.43059
C  5.566571 -0.39984 -0.102842
C  -3.859379 -0.761799 -0.930474
C  -3.713381 0.908458 0.848718
C  -5.265417 -0.645041 -0.913754
C  -5.118365 1.020908 0.864833
C  -5.903231 0.247032 -0.021843
H  -1.294151 2.028741 0.443557
H  0.942178 3.156747 0.806232
H  3.43922 3.020852 0.802247
H  2.787057 -2.366312 -0.681122
H  5.531424 1.692972 0.470385
H  5.295579 -2.493671 -0.681465
H  6.660159 -0.463408 -0.105498
H  -3.380321 -1.465676 -1.61477
H  -3.123212 1.483756 1.571558
H  -5.864195 -1.255703 -1.598463
H  -5.601003 1.698764 1.577635
H  -6.995699 0.32957 -0.008367
