program: Gaussian 09
title: 000217747
version: EM64L-G09RevD.01
frameworkgroup: C1[X(C21H23NO4)]
method: RPBEPBE
basis: SDD
operation: Freq
keyword: #p
keyword: freq=noraman
keyword: PBEPBE/SDD
title: #p freq=noraman PBEPBE/SDD
converged: YES YES NO NO
title: Mulliken charges:
elementType: O O O O N C C C C C C C C C C C C C C C C C C C C C H H H H H H H H H H H H H H H H H H H H H H H
charge: -0.300640 -0.297916 -0.271712 -0.272519 -0.463400 -0.428508 0.125133 0.123935 0.400601 0.227414 0.226935 0.265439 -0.377402 0.138264 0.145419 -0.762840 -0.760524 -0.403117 -0.900445 -0.262047 -0.249919 -0.255469 -0.378697 -0.667562 0.240042 -0.483611 0.301996 0.288785 0.226695 0.189740 0.269027 0.263450 0.189229 0.273435 0.266590 0.227358 0.278447 0.210196 0.279949 0.217754 0.220831 0.238739 0.214784 0.244201 0.274687 0.215268 0.217803 0.256009 0.278174
chargesum: 0.00000
title: Mulliken charges with hydrogens summed into heavy atoms:
elementType: O O O O N C C C C C C C C C C C C C C C C C C C C C
charge: -0.300640 -0.297916 -0.271712 -0.272519 -0.174615 -0.126512 0.125133 0.123935 0.400601 0.227414 0.226935 0.265439 -0.150708 0.138264 0.145419 -0.040623 -0.031270 -0.175758 -0.131853 -0.044293 -0.029088 0.198054 0.140192 0.021518 0.240042 -0.205438
polarizability: 2.88649228e+02 1.20182427e+01 2.56874824e+02 2.37345950e+00 -1.78133663e+01 2.29773085e+02
1716.lowfreq: -10.8002 -6.7062 -4.7705 -0.0008 -0.0005 -0.0002 8.8489 17.0640 28.0578
frequency: 6.3298 16.5504 27.9414 38.3575 48.3065 57.9620 64.7673 65.9626 84.8546 93.8712 101.2883 118.3258 125.1472 135.0060 158.3402 177.0418 201.1442 206.0676 213.5844 223.7251 225.9495 239.8027 257.3152 299.4776 305.1064 315.2424 322.8038 326.5461 341.0388 351.3653 374.4383 415.4878 429.7361 452.5785 459.0920 511.3428 518.9413 536.5668 562.3194 579.6632 592.9251 600.2889 602.4139 626.9851 640.5988 651.0129 676.8250 702.1633 721.9230 731.2149 734.9851 740.9982 750.1796 783.3947 796.9099 811.0873 818.7794 843.2546 863.6834 879.0689 939.9630 963.2012 971.7788 974.2892 980.8066 985.7756 998.9536 1005.5212 1024.1364 1032.5717 1034.5355 1040.4175 1051.4899 1062.7282 1093.6301 1094.4665 1105.2411 1143.6071 1151.0715 1172.4390 1178.4411 1209.9653 1215.4331 1227.3349 1232.7919 1272.4365 1277.8171 1296.0982 1310.3949 1317.5712 1325.2831 1344.0455 1359.1035 1380.1488 1384.8248 1404.9580 1405.3868 1410.9030 1432.9313 1443.2366 1445.2746 1451.6627 1454.9199 1461.1754 1465.4605 1473.1032 1473.6335 1476.6555 1477.3321 1484.5724 1501.1160 1579.7640 1582.8014 1589.8635 1611.4276 1628.4638 1648.1647 2145.7016 2979.1445 2989.9203 2990.8584 2992.1505 3005.6388 3027.3704 3063.9891 3067.7044 3073.2197 3081.4670 3082.9793 3086.3869 3089.7287 3090.6614 3103.4090 3105.5905 3112.0515 3115.6126 3119.6762 3134.4606 3154.7009 3426.2732 3551.2036
redmass: 4.0875 4.1186 4.6106 3.5269 5.2805 4.8008 3.5990 5.6132 2.7794 5.1426 3.1983 2.3717 1.6229 1.1216 3.0858 3.0482 4.2748 3.4212 4.7211 1.1463 1.4681 3.7200 3.3829 5.5616 3.6341 3.4396 3.1064 3.5326 3.7197 4.0206 5.2081 3.5796 3.4329 2.9655 5.5030 4.3314 5.1110 5.3247 4.9900 2.3525 5.4043 3.9473 1.8967 1.2310 4.0793 4.8691 1.2598 7.8703 5.2993 3.9471 2.4962 2.8703 2.4242 2.7532 5.5279 1.4871 4.4675 3.7497 1.4507 5.1520 1.4053 3.7327 4.2267 1.7354 1.3232 3.4287 1.6775 2.2308 2.6716 2.0132 1.5076 1.5411 2.1561 1.5378 2.2203 2.3913 4.2106 2.9407 1.7294 1.0912 2.2167 2.1692 2.5413 1.0881 4.9889 1.5922 1.1157 2.1506 1.9184 1.5046 2.1624 1.9516 1.5715 3.3927 1.2366 1.2683 1.2270 1.1715 2.1203 1.0448 1.0471 1.1265 1.1111 1.0622 1.6179 1.0925 1.0868 1.2206 2.4682 1.0513 1.1012 8.4606 6.4769 9.5067 5.9798 3.9272 9.2205 6.0166 1.0359 1.0361 1.0402 1.0400 1.0572 1.0585 1.0834 1.0980 1.1037 1.0996 1.0985 1.0966 1.0967 1.1027 1.0974 1.0970 1.0844 1.1055 1.0883 1.0938 1.1008 1.1597 1.0772
irintensity: 0.1756 0.2296 0.0948 0.0933 0.3912 1.9349 0.9529 4.7942 0.5388 0.3487 0.5479 1.3830 0.1014 0.2224 0.1461 2.8720 0.9496 2.2538 4.1479 0.3936 0.8400 2.0297 0.9500 1.3140 6.4792 3.9362 4.7647 40.1924 2.8190 0.4346 7.0833 4.9689 4.4692 3.8382 5.6463 13.1750 2.6715 16.0572 1.7384 18.4682 4.0810 2.1262 38.4895 73.5566 3.9948 5.7069 60.0286 25.4100 0.4605 0.8956 1.8554 29.1643 92.0696 1.4836 1.5801 1.1683 7.7571 10.8065 1.9361 57.8536 0.5786 82.5119 322.8326 74.3974 0.8013 15.2447 1.2401 180.0782 69.4593 63.6110 7.0395 20.6543 9.4083 21.3877 45.6227 16.5121 195.9949 14.9127 33.0314 1.8098 0.7841 563.4092 15.5002 2.3618 34.6106 2.4604 2.9484 54.9339 15.5227 1.4587 17.7659 30.8201 4.3979 5.0289 28.3816 39.0549 132.9425 14.5707 1.1193 3.0757 26.8723 58.0460 53.0630 10.7125 255.2558 28.7642 1.8858 179.6400 17.8202 15.7697 27.1869 68.5293 1.1909 136.9331 14.2668 60.7073 279.9972 0.5548 27.4428 26.8624 17.6180 45.6584 46.0640 38.7998 1.4373 0.1232 8.1554 20.7354 36.7781 17.1264 19.6315 6.2032 3.5525 5.6838 6.4110 32.2288 7.5020 39.3994 39.2688 69.2616 40.2706
temp: 298.150 k
press: 1.00000 atm
elementType: 8 8 8 8 7 6 6 6 6 6 6 6 6 6 6 6 6 6 6 6 6 6 6 6 6 6 1 1 1 1 1 1 1 1 1 1 1 1 1 1 1 1 1 1 1 1 1 1 1
symmnumber: 1
zpe: 1024057.8 jmol-1
zpe.correction: 0.390043 hartree
zpe.thermalcorrener: 0.417143 hartree
zpe.thermalcorrenthalpy: 0.418087 hartree
zpe.thermalcorrgfe: 0.329231 hartree
zpe.sumelectzpe: -1167.723346 hartree
zpe.sumelectthermal: -1167.696246 hartree
zpe.sumelectthermalent: -1167.695302 hartree
zpe.sumelectthermalfe: -1167.784159 hartree
dipole: 0.4187 -4.3517 4.4594
dipole: 6.2449
quadrupole: -135.1285 -139.7826 -146.2854
quadrupole: -2.2694 -1.3456 -5.1366
quadrupole: 5.2703 0.6162 -5.8865 -2.2694 -1.3456 -5.1366
hfenergy: -1168.1133892 hartree
pointgroup: C01 [X(C21H23N1O4)]
dipole: 0.4145578 1.329158 -2.0243503 debye
polarizability: 278.9908439|-21.280538|259.6323777|-8.5447484|-19.0045368|236.673916 unknown
InChI: InChI=1S/C21H23NO4/c1-6-12-26-21(24)18-15(5)22-14(4)17(20(23)25-7-2)19(18)16-11-9-8-10-13(16)3/h1,8-11,19,22H,7,12H2,2-5H3
charge 0 multiplicity 1
49 atoms
O  3.942226 0.206248 -0.356897
O  -3.328803 1.165923 0.028812
O  2.70775 -0.593248 1.452873
O  -2.129421 0.141459 1.757358
N  0.273495 1.295981 -2.227558
C  0.203643 -0.234174 0.166581
C  1.516982 0.247114 -0.473146
C  -0.994045 0.59802 -0.325471
C  -0.024086 -1.741222 -0.106373
C  1.512551 0.913338 -1.685179
C  -0.949261 1.258592 -1.542017
C  -0.109269 -2.699948 0.950761
C  -0.152937 -2.176707 -1.451252
C  2.726332 -0.08554 0.296676
C  -2.145612 0.600723 0.583058
C  2.702271 1.335337 -2.523012
C  -2.067925 2.001224 -2.24374
C  -0.322184 -4.061781 0.607427
C  0.023441 -2.310626 2.411998
C  -0.363865 -3.533161 -1.774244
C  -0.449353 -4.484961 -0.733385
C  5.18231 -0.11223 0.412668
C  -4.501347 1.240045 0.951613
C  5.562537 1.041729 1.345619
C  -4.838836 2.636801 1.249639
C  -5.152128 3.800584 1.508457
H  0.288102 -0.100159 1.256638
H  0.287557 1.772478 -3.129872
H  -0.085089 -1.439979 -2.260559
H  2.372482 1.809589 -3.466424
H  3.343769 0.472917 -2.762301
H  3.339859 2.048433 -1.974806
H  -1.713138 2.44321 -3.193505
H  -2.469643 2.806091 -1.607356
H  -2.915379 1.330469 -2.457358
H  -0.387717 -4.80168 1.414671
H  -0.754098 -1.578733 2.696776
H  -0.077704 -3.197328 3.061543
H  1.007619 -1.845946 2.604574
H  -0.459665 -3.844354 -2.820945
H  -0.612656 -5.544619 -0.961864
H  5.014003 -1.043703 0.980612
H  5.939407 -0.275712 -0.37195
H  -5.329128 0.737268 0.422817
H  -4.252602 0.683899 1.874745
H  6.522982 0.817037 1.846329
H  5.679764 1.984336 0.782656
H  4.793656 1.181593 2.123487
H  -5.416844 4.815868 1.741925
