program: Gaussian 09
title: 000217746
version: EM64L-G09RevD.01
frameworkgroup: C1[X(C21H22F3NO4)]
method: RPBEPBE
basis: SDD
operation: Freq
keyword: #p
keyword: freq=noraman
keyword: PBEPBE/SDD
title: #p freq=noraman PBEPBE/SDD
converged: YES YES NO NO
title: Mulliken charges:
elementType: F F F O O O O N C C C C C C C C C C C C C C C C C C C C C H H H H H H H H H H H H H H H H H H H H H H
charge: -0.172188 -0.152858 -0.172353 -0.304693 -0.296249 -0.249145 -0.251039 -0.453862 -0.405035 0.107852 0.105705 0.447879 0.208421 0.208474 0.112992 -0.368564 0.138758 0.142022 -0.762614 -0.762740 -0.312795 0.228299 -0.244096 -0.250846 -0.256967 -0.364593 -0.667095 -0.029054 -0.559719 0.326224 0.291231 0.236734 0.190329 0.269207 0.266264 0.266700 0.272436 0.189982 0.262583 0.226114 0.233743 0.213329 0.241032 0.247005 0.213779 0.217241 0.215914 0.260044 0.259544 0.221942 0.214724
chargesum: 0.00000
title: Mulliken charges with hydrogens summed into heavy atoms:
elementType: F F F O O O O N C C C C C C C C C C C C C C C C C C C C C
charge: -0.172188 -0.152858 -0.172353 -0.304693 -0.296249 -0.249145 -0.251039 -0.162631 -0.078811 0.107852 0.105705 0.447879 0.208421 0.208474 0.112992 -0.131830 0.138758 0.142022 -0.036813 -0.033622 -0.050212 0.228299 -0.017982 -0.017102 0.197394 0.096191 0.026105 0.230490 -0.123053
polarizability: 3.00128692e+02 6.90753528e+00 2.69436750e+02 3.69444940e+00 -7.55427118e+00 2.15233382e+02
1716.lowfreq: -3.4879 -0.0010 -0.0006 -0.0005 3.8904 7.5169 16.3954 21.2157 27.4627
frequency: 16.3869 21.1998 27.4524 32.1451 42.4522 53.6607 61.4157 66.2620 71.7705 85.2745 89.9728 99.7964 110.2687 112.4799 113.3009 139.4150 143.9753 154.2472 171.5343 202.6435 205.2853 220.1414 227.3148 233.7929 277.6151 298.4490 308.7572 316.1511 324.0067 326.8360 335.7337 350.0328 362.1465 367.6912 388.2757 429.8259 438.5585 443.8389 469.1790 502.6418 523.0666 553.1487 564.7180 577.1988 585.7211 594.7974 602.8583 612.7566 628.2196 638.7957 679.8147 692.1097 711.2002 727.2061 736.9291 746.5176 763.2132 775.7787 780.9392 814.9230 824.5789 840.0625 870.2623 885.0899 929.7763 948.9356 955.8136 956.8022 964.9808 974.0552 977.9403 983.3347 988.4013 992.6915 1019.4168 1022.1928 1026.1817 1034.1445 1034.7062 1040.2938 1072.6634 1094.9546 1099.8910 1105.6657 1144.8730 1151.9299 1156.6955 1178.4885 1195.1406 1223.1269 1234.4138 1248.1589 1249.0619 1272.0797 1279.0615 1280.7157 1296.9218 1321.1827 1323.7017 1334.3577 1347.0128 1359.5007 1387.9556 1389.8968 1405.4782 1410.7310 1426.2787 1436.2144 1443.4618 1445.5491 1446.1480 1452.2569 1462.3671 1467.8059 1472.9645 1476.5804 1484.9667 1487.0216 1583.2201 1586.8242 1590.0434 1612.2919 1633.5113 1655.8657 1658.8902 2991.0137 2991.6917 2992.5011 3020.1213 3028.0320 3083.8132 3086.6402 3088.5347 3089.8173 3092.2833 3098.4714 3103.0831 3105.6068 3109.9918 3116.7092 3124.6431 3131.6519 3140.4218 3151.4872 3169.8530 3199.0246 3553.2310
redmass: 4.4698 7.4681 5.4323 4.5808 3.8959 4.3919 4.6491 4.6284 5.3582 3.3419 6.4833 2.9562 4.1205 4.5740 3.4087 1.1841 1.1686 3.9069 3.0697 4.0169 4.8622 2.7809 5.7797 2.0742 4.6291 4.7719 5.0962 5.7903 3.9240 2.7902 3.7500 4.5064 4.0978 3.8980 8.8316 3.6821 6.5764 3.0896 4.1277 3.7050 10.6763 4.3604 4.6035 1.5536 5.7946 2.5395 4.0345 9.1319 2.6406 4.4730 2.6375 8.7157 6.5195 7.2180 3.1764 4.4278 1.5760 4.4509 3.2621 1.4276 4.6666 3.9041 1.7728 2.8688 1.6356 2.2831 2.3998 1.5523 2.0016 1.6128 8.4633 4.2438 1.3461 4.0112 1.6699 3.2089 2.7631 1.7495 1.5143 1.5104 2.8154 2.1966 2.5350 4.0715 3.1063 1.7207 2.0652 1.2201 2.1091 2.2484 5.5550 1.4533 1.5585 2.1309 1.1149 1.2497 2.1346 2.3186 2.2301 1.4349 1.5600 1.5408 4.2449 1.2358 1.2221 1.1730 1.1579 2.1467 1.0520 1.0466 1.1501 1.1161 1.0587 1.6823 1.0931 1.2330 1.0521 2.4305 9.8325 9.6582 7.1166 5.8812 4.0442 9.3429 4.6278 1.0363 1.0402 1.0402 1.0591 1.0586 1.0987 1.0969 1.0613 1.0967 1.1030 1.0829 1.1039 1.0972 1.0967 1.1055 1.0855 1.0958 1.0895 1.0940 1.1003 1.1141 1.0774
irintensity: 0.0341 0.1566 0.2777 0.2748 0.9315 2.4453 4.0172 0.2274 0.1432 0.4926 1.1234 0.4174 0.5458 0.0781 0.5575 0.4087 0.7841 1.1238 1.0934 1.6368 0.7893 2.2393 3.0570 0.5437 9.0225 1.7657 7.4656 6.2036 14.9658 3.7401 7.0696 3.0167 1.9006 3.2011 2.6343 3.4283 0.6460 8.7071 1.8439 1.6921 0.0317 1.8157 0.8636 37.4363 4.0166 20.5537 0.2981 12.6149 16.0642 9.4886 5.5348 11.7959 14.8107 0.1026 16.9402 21.7281 78.0493 1.0608 1.9637 0.9475 10.2633 11.7113 7.7161 87.8080 55.4708 41.6900 40.0806 122.6328 7.7624 8.6773 195.1226 245.4333 0.4469 294.7811 51.8270 133.4631 55.6230 29.2736 11.9087 7.9071 45.8452 61.9645 18.3808 239.5725 3.1283 34.2727 14.5132 0.9613 2.2730 636.2376 23.3770 61.6030 52.9702 90.2167 3.2451 9.3924 35.4830 19.2593 19.9677 4.3800 11.6182 4.3924 4.7104 29.3998 131.1562 14.9698 9.0632 15.9395 18.8903 28.3179 56.1344 37.2126 11.1378 253.4370 30.1746 213.5200 14.5728 7.8355 26.6888 211.2959 0.6788 6.6249 63.3529 275.6984 4.0962 26.8980 8.5865 54.9194 33.2400 38.6196 34.5648 15.9590 10.4963 19.5659 5.9519 10.1884 8.8415 4.1639 5.5773 31.6557 4.1318 3.8133 8.5637 15.9670 21.0487 22.1307 42.7502
temp: 298.150 k
press: 1.00000 atm
elementType: 9 9 9 8 8 8 8 7 6 6 6 6 6 6 6 6 6 6 6 6 6 6 6 6 6 6 6 6 6 1 1 1 1 1 1 1 1 1 1 1 1 1 1 1 1 1 1 1 1 1 1
symmnumber: 1
zpe: 1023262.0 jmol-1
zpe.correction: 0.389740 hartree
zpe.thermalcorrener: 0.419328 hartree
zpe.thermalcorrenthalpy: 0.420273 hartree
zpe.thermalcorrgfe: 0.326457 hartree
zpe.sumelectzpe: -1466.456973 hartree
zpe.sumelectthermal: -1466.427385 hartree
zpe.sumelectthermalent: -1466.426440 hartree
zpe.sumelectthermalfe: -1466.520256 hartree
dipole: 0.0164 -8.2686 4.3834
dipole: 9.3586
quadrupole: -146.4530 -157.1709 -158.6079
quadrupole: -0.9876 -0.9157 4.0510
quadrupole: 7.6242 -3.0936 -4.5306 -0.9876 -0.9157 4.0510
hfenergy: -1466.8467131 hartree
pointgroup: C01 [X(C21H22F3N1O4)]
dipole: 0.3413455 -2.6205463 2.5638093 debye
polarizability: 294.8957834|15.4989249|265.7976132|10.2580184|-18.8366504|224.1054279 unknown
InChI: InChI=1S/C21H22F3NO4/c1-5-11-29-20(27)17-13(4)25-12(3)16(19(26)28-6-2)18(17)14-9-7-8-10-15(14)21(22,23)24/h5,7-10,18,25H,1,6,11H2,2-4H3
charge 0 multiplicity 1
51 atoms
F  1.030497 3.747517 -1.614085
F  0.104703 1.74629 -2.0844
F  -1.217273 3.518452 -1.642708
O  3.984622 -0.585478 0.389695
O  -3.372337 -1.223358 0.371327
O  2.65801 1.006687 -0.683351
O  -2.318589 0.519539 -0.768176
N  0.424961 -2.323152 1.963059
C  0.229188 -0.009692 0.273986
C  1.56854 -0.662569 0.667847
C  -0.976437 -0.894959 0.646081
C  0.094169 1.381365 0.942366
C  1.626764 -1.747707 1.521955
C  -0.851916 -1.976653 1.498176
C  -0.014749 2.625269 0.261931
C  0.076057 1.405019 2.36235
C  2.740724 -0.003267 0.067096
C  -2.235977 -0.460581 0.021418
C  2.863597 -2.443417 2.053491
C  -1.95217 -2.888503 2.001863
C  -0.137318 3.833344 1.001644
C  -0.018367 2.850068 -1.235171
C  -0.044158 2.600307 3.095704
C  -0.152622 3.829519 2.407931
C  5.177559 0.061989 -0.237844
C  -4.656414 -0.783892 -0.27502
C  5.418808 -0.485067 -1.647939
C  -4.805855 -1.385867 -1.648674
C  -5.793207 -2.252079 -1.986207
H  0.224249 0.13346 -0.815332
H  0.492104 -3.119743 2.596935
H  0.15944 0.452965 2.898562
H  2.592202 -3.209852 2.803464
H  3.557731 -1.723531 2.513282
H  3.424178 -2.929737 1.238062
H  -2.742744 -2.313571 2.509119
H  -2.444839 -3.410746 1.165749
H  -1.549705 -3.64212 2.704298
H  -0.220549 4.782007 0.461941
H  -0.053611 2.575862 4.191173
H  -0.247782 4.772255 2.956521
H  6.001224 -0.189637 0.450501
H  5.014957 1.153639 -0.257809
H  -4.647185 0.320113 -0.327323
H  -5.437444 -1.137494 0.416846
H  5.52615 -1.583892 -1.633758
H  6.348388 -0.052188 -2.062709
H  4.585509 -0.213281 -2.316702
H  -4.066964 -1.060987 -2.392719
H  -5.887259 -2.646742 -3.003844
H  -6.543361 -2.5838 -1.256698
