program: Gaussian 09
title: 000223141
version: EM64L-G09RevD.01
frameworkgroup: C1[X(C10H10N2O6)]
method: RPBEPBE
basis: SDD
operation: Freq
keyword: #p
keyword: freq=noraman
keyword: PBEPBE/SDD
title: #p freq=noraman PBEPBE/SDD
converged: YES YES NO NO
title: Mulliken charges:
elementType: O O O O O O N N C C C C C C C C C C H H H H H H H H H H
charge: -0.284029 -0.236632 -0.181621 -0.177230 -0.177488 -0.177956 0.002185 0.002816 0.222310 0.300027 0.295482 0.295005 -0.485040 -0.512523 -0.741585 0.192817 -0.256646 -0.661301 0.322320 0.320829 0.240514 0.280014 0.239618 0.240136 0.231156 0.225924 0.230928 0.249969
chargesum: 0.00000
title: Mulliken charges with hydrogens summed into heavy atoms:
elementType: O O O O O O N N C C C C C C C C C C
charge: -0.284029 -0.236632 -0.181621 -0.177230 -0.177488 -0.177956 0.002185 0.002816 0.222310 0.300027 0.295482 0.295005 -0.162720 -0.191694 0.018561 0.192817 0.214646 0.045520
polarizability: 2.09500334e+02 5.02313763e-01 1.73837721e+02 -1.39227262e+01 2.24431735e+00 8.22363353e+01
1716.lowfreq: -0.0005 -0.0002 0.0008 1.4191 5.0476 8.6674 33.2968 46.0213 47.3985
frequency: 33.2930 46.0186 47.3978 56.6978 77.1894 91.2797 99.2928 134.6695 161.2033 178.7458 179.5011 210.7090 251.7377 282.2140 303.7923 317.7593 318.8528 348.0290 373.4902 417.2533 447.9631 462.1513 492.8764 527.4450 620.2862 633.2052 664.9970 681.1733 723.1933 724.5330 737.4223 743.3438 753.1031 807.1503 819.6673 853.8706 907.1198 959.4015 970.8823 1008.1215 1026.6285 1034.7262 1086.8484 1095.5132 1107.1805 1158.3019 1199.1827 1204.7949 1217.8214 1218.6461 1259.8557 1279.5557 1355.8141 1357.9729 1371.0990 1374.5189 1394.4954 1401.5217 1409.4669 1451.2331 1457.7242 1465.3230 1473.8424 1477.5507 1484.0716 1563.1192 1615.8571 1627.9048 2996.2696 3015.7065 3035.9606 3091.9274 3098.4004 3099.9234 3124.9008 3130.9714 3177.3020 3195.7398
redmass: 3.8373 4.5165 11.0107 8.9784 6.1412 5.9772 3.7559 5.3169 1.1996 8.1870 5.4493 1.4490 3.4266 3.5122 6.2724 4.9981 5.3532 8.7651 3.2685 3.7579 6.7778 4.5985 6.2191 5.0940 6.8450 5.2004 7.2787 11.1447 4.2926 4.5976 5.9540 7.9530 4.6001 2.1500 1.9385 7.2090 5.2467 1.5785 1.4233 2.7536 1.5062 1.5643 2.2992 2.2781 7.0726 1.7057 2.8644 3.8844 6.0237 2.2724 5.2695 1.1184 3.5408 1.3585 7.2409 8.0576 1.2287 1.1718 6.0916 1.1550 1.1225 1.0446 2.1479 1.4608 1.0637 7.4957 7.6857 10.0280 1.0362 1.0390 1.0596 1.0974 1.1031 1.0941 1.1070 1.1014 1.0927 1.0928
irintensity: 0.6794 0.9529 0.4871 0.1504 1.1102 3.8603 0.5965 3.8384 2.8428 5.7271 0.1743 4.0017 0.5054 2.7781 1.3971 3.0826 9.4679 5.6245 0.7411 5.8319 2.4501 0.2709 3.5923 1.0935 6.6465 0.8765 16.5966 51.3091 13.3054 12.7605 4.8274 1.8628 3.0883 2.0657 9.9960 15.2611 14.4392 23.4392 9.7450 68.7298 3.3457 3.6900 4.9314 75.1097 195.6019 40.6748 120.5782 156.3712 124.8973 145.6597 163.8035 6.9117 19.9951 4.8415 182.2210 8.1844 23.4170 48.6518 11.3249 12.6281 27.5136 15.5918 33.5637 14.1709 11.1223 4.9011 28.1219 169.7775 16.2527 1.2635 27.8220 32.8807 1.9460 7.8427 23.4337 7.8170 11.6409 9.3313
temp: 298.150 k
press: 1.00000 atm
elementType: 8 8 8 8 8 8 7 7 6 6 6 6 6 6 6 6 6 6 1 1 1 1 1 1 1 1 1 1
symmnumber: 1
zpe: 518011.2 jmol-1
zpe.correction: 0.197300 hartree
zpe.thermalcorrener: 0.214656 hartree
zpe.thermalcorrenthalpy: 0.215600 hartree
zpe.thermalcorrgfe: 0.150274 hartree
zpe.sumelectzpe: -946.421149 hartree
zpe.sumelectthermal: -946.403793 hartree
zpe.sumelectthermalent: -946.402849 hartree
zpe.sumelectthermalfe: -946.468175 hartree
dipole: 3.7647 1.1244 -0.0705
dipole: 3.9296
quadrupole: -90.4983 -132.1345 -103.3068
quadrupole: 0.7653 4.4097 -0.7575
quadrupole: 18.1482 -23.4880 5.3397 0.7653 4.4097 -0.7575
hfenergy: -946.6184491 hartree
pointgroup: C01 [X(C10H10N2O6)]
dipole: -1.4851659 -0.3502564 -0.2486141 debye
polarizability: 206.6089553|-6.6372629|168.5255481|22.5408415|21.2042647|90.4398868 unknown
InChI: InChI=1S/C10H10N2O6/c1-3-18-10(13)7-4-8(11(14)15)6(2)9(5-7)12(16)17/h4-5H,3H2,1-2H3
charge 0 multiplicity 1
28 atoms
O  -3.150974 -0.213662 -0.70352
O  -2.71367 1.96289 0.031681
O  0.429501 -3.288496 -1.677817
O  2.106968 3.18408 0.421497
O  2.144962 -3.300678 -0.175897
O  3.389408 1.605848 1.454417
N  1.178141 -2.71555 -0.797065
N  2.379192 1.963764 0.736955
C  1.903381 -0.397609 -0.060274
C  0.868516 -1.29805 -0.453821
C  1.434567 0.909356 0.26941
C  -0.890965 0.367286 -0.210233
C  -0.491784 -0.943752 -0.542133
C  0.085275 1.3018 0.192944
C  3.370636 -0.768587 -0.076372
C  -2.320639 0.810151 -0.268278
C  -4.616723 0.096851 -0.786548
C  -5.294235 -0.141637 0.564639
H  -1.227275 -1.681695 -0.869671
H  -0.208719 2.325737 0.441807
H  4.004256 0.111734 -0.259011
H  3.673904 -1.188782 0.898555
H  3.579008 -1.537238 -0.835439
H  -4.730454 1.143148 -1.119206
H  -4.978376 -0.594682 -1.563411
H  -6.38485 0.006207 0.45933
H  -5.120016 -1.172116 0.918539
H  -4.924935 0.567983 1.323622
