program: Gaussian 09
title: 000223137
version: EM64L-G09RevD.01
frameworkgroup: C1[X(C9H4BrNO4)]
method: RPBEPBE
basis: SDD
operation: Freq
keyword: #p
keyword: freq=noraman
keyword: PBEPBE/SDD
title: #p freq=noraman PBEPBE/SDD
converged: NO YES NO YES
title: Mulliken charges:
elementType: Br O O O O N C C C C C C C C C H H H H
charge: 0.104919 -0.235902 -0.146633 -0.196823 -0.200358 0.021618 0.410894 0.159366 -0.517343 0.393923 -0.301605 -0.144765 -0.355319 -0.331318 0.186347 0.299965 0.280676 0.273643 0.298715
chargesum: 0.00000
title: Mulliken charges with hydrogens summed into heavy atoms:
elementType: Br O O O O N C C C C C C C C C
charge: 0.104919 -0.235902 -0.146633 -0.196823 -0.200358 0.021618 0.410894 0.159366 -0.217378 0.393923 -0.020929 0.128878 -0.056605 -0.331318 0.186347
polarizability: 2.74028599e+02 5.01064528e+00 1.37688111e+02 -3.60722860e-03 -1.26783079e-02 4.69297299e+01
1716.lowfreq: -0.7569 -0.0007 -0.0006 0.0004 3.7964 6.7286 52.0134 63.9667 84.3688
frequency: 52.0062 63.9645 84.3678 113.1695 151.2942 202.0772 231.7366 255.2213 290.8366 328.1425 342.0157 385.3274 460.5794 481.2227 504.4567 545.2823 545.5426 587.4518 622.3690 690.3284 705.6747 708.9359 750.6163 759.2422 824.0659 836.9550 851.6757 901.3708 928.6269 951.4920 989.6754 1031.1420 1080.4135 1123.2715 1206.7941 1209.7959 1242.0758 1258.0799 1323.8600 1370.3009 1419.2128 1429.0076 1468.9738 1554.2771 1601.4758 1613.6483 1699.8479 3157.8841 3172.7540 3176.9208 3194.2980
redmass: 13.5930 11.2387 6.3438 16.6156 10.4794 11.6940 18.7226 5.8700 12.3289 7.2824 8.3167 4.3542 3.1693 9.3364 11.0526 6.5216 4.4479 8.7194 8.6618 7.2197 8.7258 7.8899 4.0150 9.4646 8.9591 7.1556 1.4617 1.3691 5.3718 1.5305 1.3428 4.1930 2.1459 1.4603 4.9615 3.5310 2.0695 1.6846 2.1281 11.0013 5.5186 6.5728 3.5155 7.3092 7.8639 7.6219 12.8922 1.0934 1.0929 1.0895 1.0975
irintensity: 0.2175 6.3321 0.0414 1.4616 2.3484 3.2780 0.5205 0.4190 0.5143 0.0986 0.0022 0.1531 5.3824 0.9797 0.5312 2.7554 0.0999 43.9516 8.5909 30.0520 33.8799 0.8738 9.7528 7.5796 173.3497 66.9252 44.4787 0.1067 11.2524 38.7704 0.1278 2.2165 48.7399 32.5293 342.1919 97.2368 25.0379 10.7313 32.4383 103.9365 22.5952 13.5102 15.1373 3.6050 20.9742 134.8732 426.4673 2.4379 4.0308 1.8331 3.6976
temp: 298.150 k
press: 1.00000 atm
elementType: 35 8 8 8 8 7 6 6 6 6 6 6 6 6 6 1 1 1 1
symmnumber: 1
zpe: 301936.0 jmol-1
zpe.correction: 0.115001 hartree
zpe.thermalcorrener: 0.127165 hartree
zpe.thermalcorrenthalpy: 0.128109 hartree
zpe.thermalcorrgfe: 0.074675 hartree
zpe.sumelectzpe: -713.333046 hartree
zpe.sumelectthermal: -713.320882 hartree
zpe.sumelectthermalent: -713.319938 hartree
zpe.sumelectthermalfe: -713.373372 hartree
dipole: 0.4378 -0.7021 0.0030
dipole: 0.8274
quadrupole: -124.6440 -96.1080 -93.5759
quadrupole: -20.5869 -0.0008 0.0018
quadrupole: -19.8681 8.6680 11.2001 -20.5869 -0.0008 0.0018
hfenergy: -713.448047 hartree
pointgroup: C01 [X(C9H4Br1N1O4)]
dipole: -0.1191729 -0.30291 -0.0011838 debye
dipolederiv: -0.4760206 -0.2593981 0.0000228 -0.4692652 -0.2338948 0.0000624 0.000077 0.000052 0.0497218 -1.5329304 0.1821948 0.0001849 -0.3611105 -0.3701357 0.0001423 -0.0002083 -0.0000946 -0.195807 -1.3016335 0.2793383 -0.0002427 0.5020508 -0.5300035 0.0000912 0.0010524 -0.0003612 -0.3008599 -0.9706779 -0.175866 -0.0000016 -0.1639247 -0.528464 0.0000543 -0.000522 -0.0003122 -0.2214837 -0.6689163 0.1351171 -0.0000185 0.3101368 -0.7595563 -0.0002849 -0.0001063 0.0001848 -0.2236031 2.057224 -0.1237093 0.0001409 -0.3907367 1.1024072 0.0002016 0.0003879 0.000227 0.1893436 -0.3924083 0.1201761 -0.0000168 0.2169492 -0.1815808 -0.0000637 -0.0000503 -0.0001171 0.0174873 0.9340743 -0.2138074 -0.0000191 -0.2102364 0.2214658 -0.0000006 0.0000409 0.0000062 0.146477 0.5280359 -0.0763907 0.0000131 0.0866004 -0.0320772 0.0000521 0.0003171 0.0000201 -0.0931733 -0.8677645 0.1344847 -0.0000981 -0.0080422 -0.1253001 -0.0000016 -0.0001992 -0.0001565 0.0577929 -0.4344428 0.0351239 0.0000072 -0.0823285 0.1398234 0.0000551 -0.0001861 0.0000918 -0.1411096 0.2302933 -0.1783058 0.0001054 0.0655153 0.0994756 0.0000258 0.0000778 0.0001909 -0.0131452 0.036822 -0.0578124 -0.00002 -0.2016671 0.0843982 0.0000289 0.0002704 0.0001332 -0.099554 0.4891685 0.6662259 -0.0001362 1.1782202 0.1504577 -0.0001621 -0.0001635 -0.0000513 -0.171242 1.9548205 -0.493342 0.0000673 -0.4366678 0.7913627 -0.0001213 -0.0005761 0.0003671 0.3390271 0.1454866 0.0044525 0.0000037 -0.0169689 0.0502849 -0.000031 -0.0000413 -0.0000185 0.170188 0.0839129 0.0363953 0.0000017 0.0161487 0.0157038 -0.0000368 -0.0000536 -0.0000341 0.173171 0.0902394 0.0427155 0.0000156 -0.0265112 -0.0040482 0.0000046 -0.0000827 -0.0000556 0.1435502 0.0947169 -0.0575922 -0.0000098 -0.0081623 0.1096816 -0.0000163 -0.0000339 -0.0000719 0.173219 unknown
polarizability: 271.3173294|19.6827686|140.3993804|-0.005851|0.0118117|46.9297299 unknown
InChI: InChI=1S/C9H4BrNO4/c10-7-4-5-3-6(11(13)14)1-2-8(5)15-9(7)12/h1-4H
charge 0 multiplicity 1
19 atoms
Br -4.177252 -2.04672 0.00029
O  -1.763862 1.447287 0.000213
O  -4.052171 1.14897 0.000984
O  4.501465 0.42064 0.000822
O  3.757836 -1.737628 0.000264
N  3.558885 -0.461373 -0.000103
C  -0.223585 -0.461328 -0.000154
C  -0.467497 0.947008 0.000191
C  1.117664 -0.920261 -0.000214
C  2.156975 0.023012 0.000022
C  0.589649 1.884594 0.000457
C  -1.365141 -1.352924 -0.000235
C  1.91372 1.421652 0.000361
C  -2.648577 -0.857702 -0.000126
C  -2.953418 0.584324 -0.000363
H  1.355589 -1.987929 -0.000433
H  0.354603 2.951993 0.000703
H  -1.194233 -2.434349 -0.000225
H  2.761847 2.110631 0.000543
