program: Gaussian 09
title: 000223140
version: EM64L-G09RevD.01
frameworkgroup: C1[X(C9H20O2S2)]
method: RPBEPBE
basis: SDD
operation: Freq
keyword: #p
keyword: freq=noraman
keyword: PBEPBE/SDD
title: #p freq=noraman PBEPBE/SDD
converged: YES YES NO NO
title: Mulliken charges:
elementType: S S O O C C C C C C C C C H H H H H H H H H H H H H H H H H H H H
charge: 0.124098 0.148226 -0.432612 -0.439802 -0.327185 -0.347419 -0.327130 -0.678558 -0.677123 -0.654332 -0.659824 -0.264145 -0.267937 0.214729 0.186329 0.211644 0.208279 0.207619 0.210991 0.253477 0.255147 0.255182 0.251313 0.274491 0.241831 0.264830 0.245566 0.190457 0.225671 0.226481 0.206914 0.336982 0.335808
chargesum: 0.00000
title: Mulliken charges with hydrogens summed into heavy atoms:
elementType: S S O O C C C C C C C C C
charge: 0.124098 0.148226 -0.095629 -0.103994 0.073874 0.072504 0.091481 -0.169935 -0.170628 -0.138010 -0.149428 0.151983 0.165457
polarizability: 1.86929546e+02 3.91354025e-02 1.25360820e+02 -6.08028052e+00 -2.64746617e+00 1.17541919e+02
1716.lowfreq: -14.4347 -7.6714 -0.0011 0.0015 0.0031 1.9679 10.1260 20.0339 30.2228
frequency: 1.3138 19.9781 29.5459 40.5629 57.3453 70.3849 81.2758 101.7373 111.5366 132.2451 155.0357 175.9965 195.1879 228.2088 243.3426 299.6245 319.5885 326.8455 353.1549 385.7130 453.9723 470.3796 488.4828 587.3959 619.6050 688.7434 704.6596 741.8209 771.4396 779.6327 809.3185 833.9828 894.7480 917.8132 941.6974 978.8627 995.7544 1011.2606 1036.7741 1040.6635 1044.4012 1052.3230 1064.3510 1078.6474 1105.4670 1112.6136 1154.7352 1176.9176 1183.6875 1225.6418 1229.0957 1239.5478 1266.3919 1275.0060 1279.0339 1287.6870 1290.9220 1296.8744 1316.1198 1323.7125 1339.8025 1357.9309 1371.0126 1377.8957 1420.0120 1441.6188 1442.7343 1452.8132 1457.0759 1469.7909 1470.1457 1470.8657 1484.2405 2943.1796 2959.9206 2966.7112 2978.3298 2983.4927 3003.6428 3004.9932 3016.0027 3017.1835 3022.3861 3024.1096 3045.8107 3057.9651 3076.9593 3080.2801 3084.8298 3100.6368 3102.1499 3458.8285 3562.6033
redmass: 5.4126 4.9756 4.5214 6.0173 2.4168 5.1381 1.7871 2.9073 4.0055 2.0919 3.2590 3.2504 3.3566 3.4432 2.8862 2.9545 1.9423 1.3312 3.6633 5.6978 2.3202 2.5875 1.2852 3.5490 4.6868 4.0456 5.6512 1.1044 1.2141 1.2505 1.7433 1.8124 1.3805 2.0191 4.6202 2.5802 1.5509 1.7016 2.5795 2.3809 3.3853 2.1949 2.1182 1.8782 1.3470 1.1424 1.1333 1.2770 1.2074 1.2771 1.3112 1.2368 1.2430 1.1750 1.2436 1.2057 1.0866 1.1530 1.2512 1.2040 1.3997 1.5942 1.1827 1.2091 1.1002 1.0875 1.0851 1.0867 1.0807 1.0816 1.0758 1.0841 1.0986 1.0691 1.0600 1.0607 1.0601 1.0671 1.0720 1.0732 1.0738 1.0586 1.0634 1.0881 1.1044 1.0927 1.0986 1.1088 1.1055 1.1057 1.1053 1.0648 1.0663
irintensity: 0.0873 0.2552 1.3339 2.4923 0.3359 1.1759 6.4873 2.4480 4.2293 0.6489 0.6513 6.2686 4.2164 2.4526 0.3550 3.1980 27.2002 145.5907 6.0559 3.2031 8.3058 26.7155 107.9550 7.5541 5.8966 3.3995 13.9131 14.8569 5.1685 4.9569 1.8869 3.1628 4.3233 66.9271 121.3374 5.0763 2.8185 6.1342 50.6311 2.4405 22.5002 10.0437 2.7946 1.6601 8.3521 21.3626 33.0021 13.7906 6.3020 7.4924 4.5233 1.1368 5.7944 2.5141 4.3598 16.8166 1.3138 21.8265 14.7586 22.2148 6.9491 4.3801 14.7179 51.0967 15.4178 7.4243 8.0117 2.8629 5.2936 5.0201 1.4963 7.6357 14.5978 66.0406 14.3145 16.0581 32.1366 40.9578 12.3858 30.5649 15.9546 28.4906 24.0365 10.8036 50.4980 34.9440 5.1660 46.1823 18.2096 34.3148 12.2304 17.7196 9.9481
temp: 298.150 k
press: 1.00000 atm
elementType: 16 16 8 8 6 6 6 6 6 6 6 6 6 1 1 1 1 1 1 1 1 1 1 1 1 1 1 1 1 1 1 1 1
symmnumber: 1
zpe: 736569.2 jmol-1
zpe.correction: 0.280544 hartree
zpe.thermalcorrener: 0.298627 hartree
zpe.thermalcorrenthalpy: 0.299572 hartree
zpe.thermalcorrgfe: 0.227469 hartree
zpe.sumelectzpe: -1300.398759 hartree
zpe.sumelectthermal: -1300.380676 hartree
zpe.sumelectthermalent: -1300.379732 hartree
zpe.sumelectthermalfe: -1300.451835 hartree
dipole: 2.0262 -2.6748 0.6197
dipole: 3.4124
quadrupole: -111.7938 -104.9777 -94.4553
quadrupole: 6.5815 -1.2780 5.3379
quadrupole: -8.0515 -1.2355 9.2870 6.5815 -1.2780 5.3379
hfenergy: -1300.6793036 hartree
pointgroup: C01 [X(C9H20O2S2)]
dipole: -0.7350329 0.9510605 0.5979874 debye
polarizability: 186.8858961|-4.9037757|123.2094209|3.9991488|4.3664908|119.7369688 unknown
InChI: InChI=1S/C9H20O2S2/c10-4-8-12-6-2-1-3-7-13-9-5-11/h10-11H,1-9H2
charge 0 multiplicity 1
33 atoms
S  3.259614 -0.680331 -1.126105
S  -3.624157 0.986709 1.007136
O  6.338348 -1.305507 -0.554698
O  -6.162967 -1.685296 -0.98283
C  0.363264 0.964455 -0.434505
C  1.69339 1.300391 0.275172
C  -0.855499 1.096283 0.509741
C  2.935597 1.12483 -0.616301
C  -2.175688 0.755124 -0.201286
C  4.072954 -1.334076 0.464491
C  -5.034999 0.341402 -0.079892
C  5.533025 -0.869181 0.584313
C  -5.14282 -1.191212 -0.040011
H  0.420096 -0.067735 -0.833512
H  0.233239 1.638524 -1.306581
H  1.667439 2.354557 0.624081
H  1.794568 0.676228 1.186101
H  -0.907969 2.129088 0.909515
H  -0.723318 0.422969 1.379734
H  2.822741 1.662116 -1.574619
H  3.849915 1.497598 -0.122223
H  -2.347092 1.421834 -1.065269
H  -2.175207 -0.293106 -0.548642
H  4.021125 -2.431185 0.363495
H  3.463082 -1.022534 1.330597
H  -4.871272 0.694144 -1.112698
H  -5.950394 0.821672 0.310486
H  5.577421 0.235785 0.70477
H  6.003679 -1.329619 1.470974
H  -4.204675 -1.656775 -0.382887
H  -5.343828 -1.534903 0.995405
H  5.831488 -1.056519 -1.376423
H  -7.0584 -1.394428 -0.674531
