program: Gaussian 09
title: 000223136
version: EM64L-G09RevD.01
frameworkgroup: C1[X(C8H12O3)]
method: RPBEPBE
basis: SDD
operation: Freq
keyword: #pfreq=noraman
keyword: PBEPBE/SDD
title: #p freq=noraman PBEPBE/SDD
converged: YES YES NO NO
title: Mulliken charges:
elementType: O O O C C C C C C C C H H H H H H H H H H H H
charge: -0.267355 -0.185698 -0.240021 -0.228467 -0.442847 -0.519725 -0.514224 0.151706 0.235246 -0.267085 -0.662215 0.268795 0.231120 0.241345 0.266597 0.255080 0.255606 0.264632 0.225211 0.234200 0.219067 0.251667 0.227366
chargesum: 0.00000
title: Mulliken charges with hydrogens summed into heavy atoms:
elementType: O O O C C C C C C C C
charge: -0.267355 -0.185698 -0.240021 0.040327 0.029617 0.001952 0.006013 0.151706 0.235246 0.192326 0.035885
polarizability: 1.13193168e+02 -4.69943281e+00 8.30528964e+01 -2.28931489e+00 4.98172136e-01 7.69520949e+01
1716.lowfreq: -31.9366 -14.7261 -0.0003 0.0004 0.0007 2.8079 14.1650 46.5337 64.0343
frequency: -12.4359 46.4966 64.0142 91.8416 138.6263 191.1815 226.5640 261.7132 300.8486 335.5202 428.0147 438.5900 456.3284 568.9756 593.6649 677.5616 709.9806 741.2506 787.0598 809.2859 824.2919 832.2990 905.9849 932.3973 964.8523 994.9975 1015.1901 1066.6727 1095.3894 1116.5873 1132.3638 1148.3658 1155.8775 1162.9617 1176.5001 1239.4846 1263.9420 1277.5878 1281.0667 1311.6811 1342.2730 1363.7981 1391.8368 1418.9940 1431.0292 1455.7285 1463.3213 1477.7879 1484.9613 1631.0262 1667.6374 2993.9752 3003.4741 3007.0672 3011.3283 3029.5846 3072.7212 3079.6038 3085.3298 3089.1011 3089.8154 3094.4894 3120.3935
redmass: 4.6764 5.8769 3.1978 3.7987 2.7128 1.8885 1.7214 1.8277 3.3062 4.3172 2.7039 3.2555 3.2847 3.3972 3.3663 3.6516 3.0635 3.3014 2.4557 1.9785 2.1569 2.7022 2.1798 1.8628 1.9445 1.8053 2.7428 2.3750 2.2242 3.9876 1.4783 1.3503 1.7311 2.5624 1.4111 1.3043 1.4164 1.1239 1.4505 1.4722 1.3534 1.5590 1.2328 1.0870 1.0842 1.0964 1.0435 1.0874 1.0508 8.5785 12.1246 1.0361 1.0644 1.0641 1.0638 1.0596 1.0869 1.0986 1.0972 1.0975 1.1013 1.1032 1.1061
irintensity: 0.1867 2.3443 2.0436 0.4536 6.7773 4.1500 2.1101 1.1888 10.9122 12.4384 4.0430 1.2521 4.0322 8.5957 0.6513 3.6828 6.2051 11.5872 4.8332 6.6614 6.7206 3.3837 5.2758 7.8489 10.4940 12.8535 41.3312 8.5589 63.6681 346.0590 25.5305 3.8564 27.3489 47.0189 5.1951 6.8492 7.1883 2.9262 10.5036 2.0935 28.4850 25.7951 22.9532 21.5662 22.8257 11.8915 14.7685 7.0000 12.9307 131.3762 210.5771 18.8035 4.4453 12.5747 27.5999 28.7595 13.4571 12.4950 2.5764 35.5970 19.9576 0.7411 32.8311
temp: 298.150 k
press: 1.00000 atm
elementType: 8 8 8 6 6 6 6 6 6 6 6 1 1 1 1 1 1 1 1 1 1 1 1
symmnumber: 1
zpe: 493886.0 jmol-1
zpe.correction: 0.188111 hartree
zpe.thermalcorrener: 0.198673 hartree
zpe.thermalcorrenthalpy: 0.199617 hartree
zpe.thermalcorrgfe: 0.151139 hartree
zpe.sumelectzpe: -536.867154 hartree
zpe.sumelectthermal: -536.856593 hartree
zpe.sumelectthermalent: -536.855649 hartree
zpe.sumelectthermalfe: -536.904127 hartree
dipole: -3.4715 3.1255 1.4070
dipole: 4.8785
quadrupole: -68.6073 -68.1952 -63.8032
quadrupole: 9.0056 4.2969 -3.8420
quadrupole: -1.7387 -1.3266 3.0653 9.0056 4.2969 -3.8420
hfenergy: -537.0552656 hartree
pointgroup: C01 [X(C8H12O3)]
dipole: -1.3134645 -1.3986668 0.0490732 debye
dipolederiv: -1.5649692 -0.1734022 0.082533 -0.3027254 -0.5451955 -0.0179479 0.2245632 -0.0069679 -0.3318479 -0.8163596 -0.345822 0.0253004 -0.3977546 -0.6379194 0.0990133 0.0079646 0.0934139 -0.4586881 -0.7106827 0.0417583 0.0773649 -0.2555645 -0.7956665 -0.1114814 0.0119937 -0.2105573 -0.3525153 -0.2495959 0.1055024 0.0454883 0.15856 -0.0026286 0.0101556 -0.0581241 0.0171607 0.0681549 0.1637464 -0.0308538 -0.0268433 -0.0135472 0.104749 -0.0025819 0.1440842 0.0012532 0.0607053 -0.1472875 -0.1077935 -0.2183879 -0.0342399 0.0032501 0.0003257 -0.3129722 -0.0498668 -0.262049 -0.0134266 -0.1001513 -0.0106699 -0.1042201 -0.0904843 0.183057 0.0527167 0.2442436 -0.3737472 0.8948132 0.478375 0.1600705 0.5046402 0.5896662 -0.2423694 0.193254 -0.244881 0.8453132 1.7334124 0.153323 -0.1690023 0.5589271 0.9825045 0.1861371 -0.2041699 0.2780946 0.2344796 0.8063837 -0.0452389 -0.0366407 -0.2030194 0.2861139 0.000039 -0.1821214 -0.0660656 0.3151142 -0.1090833 0.0451549 -0.0359056 0.0958261 -0.0210777 0.0631724 -0.0010942 0.1057252 -0.0453427 0.0062106 -0.0527924 -0.0498958 -0.0670598 0.0014006 -0.0710694 -0.0293972 -0.0715377 0.0079355 -0.0442937 0.117257 0.0188416 0.0856034 -0.0651406 -0.0609794 -0.0009352 -0.0862365 0.0400414 0.0117968 -0.088461 0.0862733 -0.0610537 0.0332388 0.0586394 0.0741395 0.0789085 -0.0390527 0.0573925 0.0274731 -0.0483584 0.0192358 -0.0190383 0.0760647 -0.0240663 0.0417881 0.0903465 -0.0117061 0.0179081 0.0761731 0.0127326 0.0626562 -0.0853514 0.0734266 -0.0465587 0.0140214 -0.0802618 0.0319395 -0.0899336 0.0092736 0.0657441 0.0424145 -0.07526 0.0140494 0.07491 0.0847732 0.0325993 0.0747305 0.0119033 -0.0000032 -0.0535491 0.0530171 -0.0512565 0.0546103 -0.0455187 -0.0458998 0.0429735 -0.0588066 -0.0685369 0.0976558 0.0514196 0.0597813 0.0593983 -0.0038463 -0.0191326 -0.0826266 0.0612586 0.0376306 -0.0991805 0.0006469 -0.043382 -0.0567879 -0.1274534 0.0775158 0.0779392 0.102126 0.093235 -0.0237798 0.0726728 -0.0321852 0.0538519 0.0607378 -0.1111719 0.0403127 -0.0842841 -0.0216935 0.0630048 0.0064718 0.0506413 0.0635677 0.1052182 -0.0080869 -0.039737 -0.0378114 0.0071958 -0.1113889 -0.0782301 -0.0755644 -0.0624192 unknown
polarizability: 112.734285|6.2935662|82.8166738|-0.9615301|-2.1764789|77.6472 unknown
InChI: InChI=1S/C8H12O3/c1-2-11-8(10)6-3-4-7(9)5-6/h6H,2-5H2,1H3
charge 0 multiplicity 1
23 atoms
O  -2.040897 -0.920555 0.023237
O  3.23799 1.294879 -0.411334
O  -0.874975 1.061945 0.42616
C  0.269817 -0.864035 -0.630186
C  1.125752 -1.521068 0.519607
C  1.262765 0.100316 -1.323898
C  2.071741 -0.395136 0.9930
C  2.320435 0.456786 -0.261611
C  -0.905125 -0.11013 -0.021017
C  -3.270076 -0.319286 0.634919
C  -4.050957 0.489101 -0.404555
H  -0.130916 -1.637986 -1.303702
H  1.707577 -2.355151 0.085477
H  0.495038 -1.937044 1.322827
H  0.800954 1.021494 -1.716676
H  1.773616 -0.401316 -2.168606
H  3.022367 -0.743139 1.429876
H  1.578878 0.25568 1.741481
H  -3.835045 -1.19546 0.990808
H  -2.963629 0.312461 1.48715
H  -4.994921 0.854553 0.04068
H  -3.467986 1.363558 -0.738385
H  -4.301502 -0.132765 -1.281249
