program: Gaussian 09
title: 000223134
version: EM64L-G09RevD.01
frameworkgroup: C1[X(C8H8N2O)]
method: RPBEPBE
basis: SDD
operation: Freq
keyword: #pfreq=noraman
keyword: PBEPBE/SDD
title: #p freq=noraman PBEPBE/SDD
converged: NO YES NO NO
title: Mulliken charges:
elementType: O N N C C C C C C C C H H H H H H H H
charge: -0.242683 -0.452529 -0.440136 0.286151 0.251036 -0.525070 0.503056 -0.332514 -0.381025 0.103813 -0.811793 0.238411 0.329040 0.232243 0.328247 0.229771 0.235889 0.222491 0.225600
chargesum: 0.00000
title: Mulliken charges with hydrogens summed into heavy atoms:
elementType: O N N C C C C C C C C
charge: -0.242683 -0.123489 -0.111889 0.286151 0.251036 -0.286659 0.503056 -0.100271 -0.151254 0.103813 -0.127813
polarizability: 1.61679429e+02 3.31012917e+00 1.00080940e+02 3.57911825e-01 -1.11561773e-01 4.61453280e+01
1716.lowfreq: -9.0883 -0.0006 -0.0006 0.0001 1.4798 6.8030 42.2288 108.0421 186.1115
frequency: 41.9176 108.0408 186.1114 242.4797 270.5126 361.3523 364.7224 427.4417 439.6684 525.8923 529.3014 570.3887 581.5181 597.8292 689.1905 708.3020 749.0625 757.9969 805.4671 846.4743 869.0974 932.1085 937.7250 961.5225 1001.7827 1046.1189 1124.9495 1154.0658 1187.3806 1241.3896 1268.7024 1284.8244 1326.6692 1334.5938 1398.4707 1412.1948 1471.3892 1473.2695 1482.9329 1501.6534 1619.0223 1645.9233 1700.3210 2973.5476 3054.2840 3082.9560 3130.0187 3138.3618 3157.5539 3622.8553 3624.5034
redmass: 1.0242 5.6448 4.5769 4.1142 4.4304 3.7410 5.4330 3.0929 6.1876 4.5021 1.1983 1.0416 5.6020 3.3625 7.3608 11.5365 4.0122 5.4825 1.3622 3.9018 1.4158 1.3446 3.2066 3.8067 1.5019 1.5260 2.1282 1.8927 1.8805 1.4674 1.7990 3.9351 1.9002 2.8104 1.2245 2.8760 1.6086 1.0747 2.2855 2.9421 6.8843 7.6552 7.8655 1.0386 1.0952 1.0996 1.0883 1.0924 1.0966 1.0796 1.0821
irintensity: 0.6190 0.0133 0.8057 0.3973 1.6034 3.4287 0.6190 2.8241 1.5929 10.4262 2.6818 258.6882 5.1693 13.3152 13.4630 16.6364 0.0397 1.6975 61.8595 0.9763 12.9470 1.6716 0.0926 29.6980 8.1479 18.1456 2.3721 6.2519 48.0404 8.2631 3.0736 37.7886 24.3180 57.9350 7.9531 4.6013 4.6907 16.1805 57.5799 67.4175 7.5693 9.9684 851.4216 42.9646 23.5551 18.9443 12.0952 12.5782 12.1042 111.1745 20.4080
temp: 298.150 k
press: 1.00000 atm
elementType: 8 7 7 6 6 6 6 6 6 6 6 1 1 1 1 1 1 1 1
symmnumber: 1
zpe: 388570.2 jmol-1
zpe.correction: 0.147999 hartree
zpe.thermalcorrener: 0.157092 hartree
zpe.thermalcorrenthalpy: 0.158036 hartree
zpe.thermalcorrgfe: 0.113374 hartree
zpe.sumelectzpe: -493.639819 hartree
zpe.sumelectthermal: -493.630726 hartree
zpe.sumelectthermalent: -493.629782 hartree
zpe.sumelectthermalfe: -493.674444 hartree
dipole: 3.7653 0.4004 0.0474
dipole: 3.7868
quadrupole: -77.3614 -50.2915 -67.7695
quadrupole: -4.3252 0.1756 0.0043
quadrupole: -12.2206 14.8493 -2.6287 -4.3252 0.1756 0.0043
hfenergy: -493.787818 hartree
pointgroup: C01 [X(C8H8N2O1)]
dipole: -1.4840305 0.1306313 -0.0156347 debye
dipolederiv: -1.8084178 0.1628212 0.0034882 0.1858813 -0.4846745 0.0001651 0.003748 -0.0005379 -0.3916888 -1.2281906 0.0184197 0.0054701 -0.2133243 -0.4629741 0.0011697 0.0047063 0.0022624 -0.35041 -1.1336703 0.1103015 -0.0004376 0.3969078 -0.5605162 0.0007993 0.0008972 0.0004109 -0.344155 0.6327763 -0.2585516 -0.0021848 -0.7010386 0.1367212 -0.0008454 -0.0069705 -0.0047329 0.0747895 0.8017465 0.1193494 -0.0032428 0.5224939 -0.1302184 -0.002912 -0.0032169 0.0001041 0.0419392 -0.0944854 0.0286617 -0.0008733 -0.0072898 0.0606846 0.0051944 -0.011195 0.0007344 -0.2082839 0.2201704 0.062008 0.0117128 0.3157836 0.0326276 0.0052442 0.0894936 0.0301619 -0.03968 0.0825103 -0.096261 -0.0034584 0.0194896 0.0931413 0.0054935 -0.0115562 0.002195 -0.1712936 -0.2182058 0.0179189 0.0052735 -0.294828 -0.0067876 -0.0049125 0.0027826 -0.0091515 -0.2000415 2.4359616 -0.1718413 -0.0062472 -0.2072323 1.0118442 -0.0043821 -0.0070642 -0.0009413 0.268692 -0.0841155 -0.0572092 -0.0034469 -0.0408733 0.0649001 -0.0037335 -0.1023757 -0.0293747 0.074554 0.0836939 -0.0203311 0.0039914 -0.0259452 -0.0947623 0.0006785 0.004526 0.0049134 0.1705136 0.1523488 -0.0219947 0.0008924 -0.040787 0.2219306 0.0006894 0.0009595 0.0009599 0.3646612 0.0767418 -0.050641 0.0013771 -0.0354286 -0.0919791 -0.0006073 0.0032206 -0.0013414 0.1732563 0.1709621 0.0362908 0.0005611 0.0543719 0.2084809 0.0002685 0.0012279 0.0000522 0.3657864 -0.065692 0.1049057 0.0027279 0.0915512 0.0227807 0.0019429 0.008088 -0.0009472 0.1577435 -0.0374853 -0.0465894 -0.0643718 -0.0563807 0.0925216 -0.0020018 -0.1256788 -0.0282792 -0.1020093 0.056228 0.0320324 -0.0166602 -0.0705988 -0.118672 0.0897001 0.0386157 0.0869903 0.0724346 -0.042877 0.03071 0.0654285 0.1072473 0.0049513 -0.0919509 0.109792 -0.0534783 0.0431916 unknown
polarizability: 161.7802471|-2.189792|99.9809613|0.1231281|0.1469671|46.1444891 unknown
InChI: InChI=1S/C8H8N2O/c1-5-2-3-6-7(4-5)10-8(11)9-6/h2-4,9-10H,1H3
charge 0 multiplicity 1
19 atoms
O  3.711836 -0.364119 -0.009979
N  1.448883 -1.179199 -0.000264
N  1.753686 1.032646 -0.007771
C  0.167139 -0.598445 0.001443
C  0.361961 0.817213 -0.003319
C  -1.120626 -1.159421 0.012612
C  -2.241931 -0.285621 0.014985
C  -0.735855 1.692406 0.003393
C  -2.032482 1.121044 0.013784
C  2.466147 -0.191315 -0.007041
C  -3.653044 -0.850987 -0.005758
H  -1.267144 -2.24538 0.019699
H  1.671295 -2.171709 0.00284
H  -0.603658 2.779191 0.005648
H  2.233845 1.929268 -0.010236
H  -2.904197 1.785747 0.022435
H  -4.047341 -0.908012 -1.03921
H  -3.688202 -1.870718 0.416442
H  -4.348612 -0.219393 0.575097
