program: Gaussian 09
title: 000223130
version: EM64L-G09RevD.01
frameworkgroup: C1[X(C5H11NO2)]
method: RPBEPBE
basis: SDD
operation: Freq
keyword: #p
keyword: freq=noraman
keyword: PBEPBE/SDD
title: #p freq=noraman PBEPBE/SDD
converged: YES YES NO NO
title: Mulliken charges:
elementType: O O N C C C C C H H H H H H H H H H H
charge: -0.420946 -0.245847 -0.580623 -0.079105 -0.392807 -0.468207 -0.698970 0.178202 0.202081 0.222371 0.209321 0.240405 0.291527 0.213096 0.213350 0.208195 0.260864 0.275293 0.371800
chargesum: 0.00000
title: Mulliken charges with hydrogens summed into heavy atoms:
elementType: O O N C C C C C
charge: -0.049146 -0.245847 -0.044467 0.122976 0.038885 0.063725 -0.064329 0.178202
polarizability: 8.58364743e+01 -1.39063210e-01 6.31311246e+01 9.05182264e-03 -3.68564130e+00 5.83623822e+01
1716.lowfreq: -18.4129 -2.0772 -0.0008 -0.0005 -0.0004 0.4067 35.8722 61.0818 110.1043
frequency: 35.7125 60.9034 110.0830 154.1401 231.1757 259.8563 264.0695 314.1552 415.2435 440.5619 480.5497 526.7298 590.6144 648.8230 668.1794 774.5647 829.6256 883.6989 929.8114 961.4282 1003.4540 1034.8051 1069.8174 1094.0286 1138.0657 1165.2576 1219.7888 1241.7742 1281.5134 1292.6255 1330.0005 1365.8051 1369.1013 1384.0228 1443.9625 1464.6537 1469.9457 1475.2136 1635.7725 1662.0001 2963.6146 2964.7675 2977.8346 2991.8649 3041.1127 3060.5926 3067.4526 3068.7338 3426.8208 3511.0957 3554.9804
redmass: 5.4153 3.4141 2.9671 2.4007 1.0945 1.4674 2.1136 3.0486 2.3311 2.2500 2.3065 2.1093 3.2645 1.5193 1.5368 1.4229 2.9185 2.6517 1.6877 1.6725 1.2949 3.1141 2.2391 2.3343 1.4724 2.0473 1.4118 1.4982 1.4745 1.1831 1.5355 1.5046 1.5728 1.2397 1.0822 1.0745 1.0507 1.0729 1.0929 7.9943 1.0541 1.0468 1.0817 1.0635 1.0967 1.0982 1.0987 1.0997 1.0450 1.0638 1.0963
irintensity: 1.1109 0.3198 1.0098 11.2822 0.1040 32.3065 19.0687 2.3105 12.8540 11.0420 18.1285 60.5329 26.7717 96.8646 220.0386 14.1879 15.5048 2.9917 10.3983 7.3840 2.5838 178.7046 104.1053 1.2982 4.1432 46.2203 35.0265 0.0401 25.3797 1.0830 42.7445 36.7381 6.4659 23.2048 21.9592 6.5070 7.3701 22.4283 38.6962 213.7024 63.2360 9.7064 14.8093 35.1575 6.2790 6.5505 74.8218 49.1540 1.3027 17.6124 0.3959
temp: 298.150 k
press: 1.00000 atm
elementType: 8 8 7 6 6 6 6 6 1 1 1 1 1 1 1 1 1 1 1
symmnumber: 1
zpe: 420788.9 jmol-1
zpe.correction: 0.160270 hartree
zpe.thermalcorrener: 0.170009 hartree
zpe.thermalcorrenthalpy: 0.170953 hartree
zpe.thermalcorrgfe: 0.124753 hartree
zpe.sumelectzpe: -401.674207 hartree
zpe.sumelectthermal: -401.664468 hartree
zpe.sumelectthermalent: -401.663524 hartree
zpe.sumelectthermalfe: -401.709724 hartree
dipole: -2.0273 0.7566 -0.6224
dipole: 2.2517
quadrupole: -40.4244 -53.3684 -49.1222
quadrupole: -0.3492 -2.2836 2.8842
quadrupole: 7.2139 -5.7300 -1.4839 -0.3492 -2.2836 2.8842
hfenergy: -401.8344767 hartree
pointgroup: C01 [X(C5H11N1O2)]
dipole: -0.8047735 0.2311279 -0.2892897 debye
dipolederiv: -1.0257658 -0.3989222 0.3885529 -0.3593434 -0.5541669 0.1060135 0.3545244 0.0959282 -0.502021 -0.7017066 0.0970238 -0.1395676 -0.0366703 -0.6426923 0.3188287 -0.0177517 0.3483516 -0.6678485 -0.6104065 -0.1921113 0.0375503 -0.1687805 -0.690435 -0.2085144 0.0507128 -0.1995759 -0.2971855 0.3672767 -0.0029076 -0.0808292 0.0432295 0.485286 0.1343736 -0.0058372 0.1743005 0.3556324 -0.0214089 0.0333209 0.0105753 0.0410241 0.0346713 0.0217667 -0.0588001 0.0385377 0.1140602 -0.4542368 0.0544937 -0.076284 0.308275 -0.079882 0.0724121 -0.0695771 0.0670642 0.0713472 -0.1192608 -0.1432796 -0.0029107 -0.073515 -0.0842419 -0.0476214 0.0156286 -0.0185028 0.0679484 1.5982766 0.1508801 -0.0887826 0.1497311 0.7820616 -0.5893783 -0.090541 -0.5978935 0.786643 0.0412192 -0.012205 0.0059657 0.0112998 -0.039704 0.0870054 -0.0079037 0.0661079 -0.1597085 0.0834391 0.0032555 0.0182702 -0.0256691 0.0549513 0.0570291 0.0146282 0.0786306 -0.0986676 0.0445104 0.0053585 0.0089588 -0.01558 -0.0844773 -0.1089069 0.0204966 -0.1304448 -0.0111477 0.0518242 -0.0156345 0.0142759 -0.0576599 0.0996853 0.0343075 0.0218603 0.0597121 -0.0864686 0.2571997 0.0010474 -0.0307744 -0.1053901 0.0309942 -0.0428789 -0.0993465 -0.0511407 0.0724979 0.082595 0.0132906 0.0340867 -0.0287702 -0.0802881 -0.1364307 0.0030351 -0.1515701 -0.0485718 -0.1813392 0.06203 -0.019798 0.1122114 0.0245236 0.0179322 -0.0190789 0.01435 0.0897298 0.0793099 0.0090113 -0.0497313 -0.0217254 0.0323794 0.0714271 0.0106315 0.1162851 -0.1254535 0.2807871 0.0679675 0.0698762 0.0476173 0.1521887 0.1315574 0.0218481 0.0362639 0.025569 0.0244107 0.2113494 -0.0107248 0.0788025 0.2528805 -0.0180451 -0.0212077 -0.0444297 0.1463941 0.2032761 0.0560315 -0.0887094 0.1009133 0.3062656 0.0991225 -0.1233216 0.0980257 0.2672508 unknown
polarizability: 85.7922995|0.9595506|62.2294492|0.5632532|-4.126027|59.3082324 unknown
InChI: InChI=1S/C5H11NO2/c1-4(6)2-3-5(7)8/h4,7H,2-3,6H2,1H3
charge 0 multiplicity 1
19 atoms
O  2.979157 0.690464 -0.454224
O  2.11901 -0.813886 1.086937
N  -2.072297 1.226197 0.683196
C  -1.948264 0.109883 -0.289154
C  -0.553895 -0.542762 -0.121616
C  0.580342 0.468431 -0.37269
C  -3.072574 -0.952128 -0.17531
C  1.913918 0.019627 0.174791
H  -1.999463 0.567587 -1.298573
H  -0.457766 -0.948199 0.905277
H  -0.465592 -1.404879 -0.809319
H  0.694957 0.710848 -1.444253
H  0.296417 1.415553 0.134588
H  -2.971847 -1.734591 -0.951694
H  -4.069288 -0.486132 -0.287154
H  -3.035935 -1.449392 0.813397
H  -2.058165 0.903985 1.659457
H  -2.875544 1.840173 0.508349
H  3.83403 0.397521 -0.035305
