program: Gaussian 09
title: 000223275
version: EM64L-G09RevD.01
frameworkgroup: C1[X(C19H26O11)]
method: RPBEPBE
basis: SDD
operation: Freq
keyword: #p
keyword: freq=noraman
keyword: PBEPBE/SDD
title: #p freq=noraman PBEPBE/SDD
converged: NO YES NO NO
title: Mulliken charges:
elementType: O O O O O O O O O O O C C C C C C C C C C C C C C C C C C C H H H H H H H H H H H H H H H H H H H H H H H H H H
charge: -0.215267 -0.415281 -0.217247 -0.398452 -0.428105 -0.417580 -0.408722 -0.296792 -0.240728 -0.222974 -0.248947 0.309785 0.341256 -0.572672 -0.603413 -0.159203 0.079574 -0.529880 -0.514951 -0.492009 -0.522118 0.112652 -0.501836 -0.487247 -0.522923 -0.517467 0.229774 0.184720 0.170469 0.177895 0.226125 0.257385 0.231225 0.241508 0.271926 0.234852 0.279265 0.220654 0.275686 0.263600 0.246196 0.239485 0.252161 0.269695 0.299084 0.236634 0.244206 0.259780 0.276661 0.260100 0.303620 0.383119 0.381148 0.411302 0.380501 0.381774
chargesum: 0.00000
title: Mulliken charges with hydrogens summed into heavy atoms:
elementType: O O O O O O O O O O O C C C C C C C C C C C C C C C C C C C
charge: -0.215267 -0.032162 -0.217247 -0.017304 -0.016803 -0.037079 -0.026948 -0.296792 -0.240728 -0.222974 -0.248947 0.309785 0.341256 -0.089162 -0.130680 0.112723 0.079574 -0.015763 -0.018611 0.017787 -0.030472 0.112652 0.066943 -0.006407 0.013518 0.046253 0.229774 0.184720 0.170469 0.177895
polarizability: 2.61545370e+02 7.88806502e-01 2.35695978e+02 9.02057724e+00 -2.12217353e+00 1.96489760e+02
1716.lowfreq: -12.6530 -2.9763 -0.0009 -0.0008 -0.0007 6.5630 18.0112 22.9427 24.7406
frequency: 17.9446 22.9164 24.4522 27.8811 29.8172 31.8482 42.5821 44.9187 48.1923 60.6879 75.3211 89.2948 102.2455 104.1319 117.6149 122.6098 127.9542 135.5638 141.5366 162.6665 181.2612 183.5017 199.3758 215.7015 236.4332 248.9636 257.9865 263.0298 286.4238 311.8423 331.3832 343.5811 366.0463 378.1353 408.0062 420.3460 438.8358 449.8264 458.0446 487.8928 503.4580 512.1822 526.3347 532.6860 539.1458 545.3726 570.5042 578.2276 594.1576 602.0218 605.3939 619.7699 629.5809 648.3185 660.4182 661.4004 669.1931 701.5180 721.5741 742.3935 749.6828 770.0058 798.3882 799.1119 814.1391 843.0995 859.2826 870.9600 881.0926 897.0443 901.8572 925.8346 931.7607 951.6555 972.3363 989.9938 994.1388 1021.7317 1031.0322 1044.8003 1046.5421 1053.3591 1066.5054 1074.9394 1078.6051 1080.2612 1087.3882 1101.0345 1110.9947 1124.6772 1126.1316 1141.9967 1159.9813 1180.2305 1204.8934 1207.1440 1212.1180 1217.7595 1243.0830 1248.2005 1250.7137 1257.6931 1261.9263 1267.6229 1280.3146 1289.9511 1296.2260 1302.2487 1306.3892 1310.7243 1314.2939 1330.2725 1332.1303 1341.2087 1343.2995 1365.8268 1371.6332 1374.9383 1378.7276 1385.4716 1433.9398 1442.3691 1449.1980 1451.1164 1462.7758 1475.0557 1477.4979 1479.9985 1482.9669 1499.0738 1573.4667 1636.9112 1646.0111 1651.8258 1656.8967 1669.4955 2970.1495 2978.8366 2985.6849 2988.1764 2990.8971 2996.0217 3003.2374 3012.1015 3012.5635 3013.7714 3020.6952 3043.4836 3045.2688 3052.9640 3054.9453 3061.8322 3069.3765 3073.8955 3081.9431 3091.5373 3093.1637 3362.3301 3507.1249 3508.6690 3510.6508 3514.2508
redmass: 12.4805 12.9858 7.6223 6.9369 8.5661 7.5398 8.4174 6.5432 6.7560 7.3807 6.3085 2.5083 5.4948 5.4264 3.8028 7.1807 7.2286 4.0424 3.5746 4.6503 6.7080 4.7015 4.4997 3.9539 6.8143 2.5684 3.4377 3.0937 2.9078 4.0297 4.0291 3.7913 3.0845 2.7861 3.0355 3.2091 3.0125 3.7206 2.6397 3.2978 2.8227 2.0693 2.4709 3.1654 2.8121 3.5576 3.0877 3.7947 2.9884 1.5245 2.3651 1.7774 2.9538 1.3930 1.6112 1.6405 2.6824 2.5264 3.8708 3.2238 2.5460 1.4495 2.2665 2.2107 3.1126 3.3167 2.2656 4.2353 2.3333 3.3969 3.0314 2.9464 3.0166 2.1101 2.1991 2.2315 2.5180 2.4928 3.1399 3.0889 2.6416 2.8317 2.5700 2.3223 2.1884 1.9536 2.5324 2.7926 2.3788 2.0750 2.7746 2.6858 2.6540 1.3337 1.4961 1.2865 1.3498 1.4377 1.4222 1.4820 1.3500 1.5313 1.5483 1.1908 1.2315 1.2689 1.3145 1.2443 1.3169 1.5934 1.7661 1.4372 1.5355 1.4163 1.3821 1.6891 1.7428 1.6586 1.6881 1.6687 1.0798 1.0848 1.0809 1.1166 1.0830 1.0849 1.0831 1.0811 1.0819 1.0848 10.7728 7.4905 7.6663 7.8811 8.7384 8.2540 1.0676 1.0624 1.0618 1.0618 1.0631 1.0646 1.0638 1.0658 1.0639 1.0781 1.0616 1.0977 1.0998 1.0935 1.1003 1.0969 1.0974 1.0939 1.0996 1.0955 1.0998 1.0635 1.0638 1.0639 1.0639 1.0641
irintensity: 1.0358 1.4371 0.2975 0.1061 0.6745 0.1653 2.1201 3.4690 0.5911 2.6479 0.6797 0.8491 5.2120 3.3717 6.8684 1.0841 0.3488 0.6422 3.1579 8.7662 1.3979 2.0978 1.1416 1.4073 0.6090 0.7126 2.6294 0.6849 0.2183 6.8590 5.2317 5.8182 4.8658 3.6784 1.3501 17.9519 3.2679 47.0890 18.4448 24.1864 8.3187 46.4027 73.1191 45.4805 21.4428 20.1459 27.4842 11.9323 11.2911 30.9459 132.5393 191.2212 50.1451 113.8821 159.4635 6.0571 74.8485 107.7900 41.4553 4.8872 6.5425 14.7738 16.5585 8.9850 5.3556 13.3789 17.1889 8.8175 2.1712 3.0469 14.7202 11.8680 7.3585 3.6130 31.3052 48.0655 4.9002 195.6070 56.8717 164.2560 212.7196 136.0435 5.5142 86.5364 72.6862 170.1030 68.0143 140.8786 28.3238 13.2141 63.0018 24.1789 29.3474 13.2387 5.9449 10.9533 37.7287 4.1472 1.7388 0.0613 5.5852 1.7929 6.1713 35.8463 9.2955 6.3342 8.5735 2.1012 7.7793 44.6030 110.9115 31.4771 4.6234 37.0609 11.8689 21.7097 17.5692 30.1045 40.7124 47.1430 12.8103 12.1158 39.3003 20.7186 9.6435 18.3151 8.1508 6.8265 17.1504 28.6247 68.4734 248.2761 236.8583 109.9568 237.7802 203.1798 22.2716 16.6999 9.3903 8.0840 29.2449 18.8484 19.3747 18.0734 5.9332 5.3313 18.0966 2.5912 34.3535 5.8967 12.4889 1.0956 7.7195 17.1479 22.5023 2.9323 14.1823 179.7933 30.4927 31.6719 25.1126 27.9414
temp: 298.150 k
press: 1.00000 atm
elementType: 8 8 8 8 8 8 8 8 8 8 8 6 6 6 6 6 6 6 6 6 6 6 6 6 6 6 6 6 6 6 1 1 1 1 1 1 1 1 1 1 1 1 1 1 1 1 1 1 1 1 1 1 1 1 1 1
symmnumber: 1
zpe: 1153607.0 jmol-1
zpe.correction: 0.439386 hartree
zpe.thermalcorrener: 0.471047 hartree
zpe.thermalcorrenthalpy: 0.471991 hartree
zpe.thermalcorrgfe: 0.371882 hartree
zpe.sumelectzpe: -1564.822718 hartree
zpe.sumelectthermal: -1564.791057 hartree
zpe.sumelectthermalent: -1564.790112 hartree
zpe.sumelectthermalfe: -1564.890221 hartree
dipole: -1.8433 0.2922 3.3312
dipole: 3.8184
quadrupole: -181.0781 -163.1043 -187.9536
quadrupole: -3.8258 2.2055 6.3336
quadrupole: -3.6994 14.2744 -10.5750 -3.8258 2.2055 6.3336
hfenergy: -1565.2621034 hartree
pointgroup: C01 [X(C19H26O11)]
dipole: 0.9250889 -0.2143706 1.1640833 debye
polarizability: 255.718344|9.9650646|235.8487022|-16.6801057|6.9981134|202.164062 unknown
InChI: InChI=1S/C19H26O11/c20-12(21)1-5-18(6-2-13(22)23)9-11(16(28)29)10-19(17(18)30,7-3-14(24)25)8-4-15(26)27/h11,20,22,24,26,28H,1-10H2
charge 0 multiplicity 1
56 atoms
O  0.104121 -0.380704 -1.918808
O  -0.92677 2.638134 3.719502
O  0.890302 3.771174 2.823287
O  -2.868361 -4.149844 -0.008818
O  -5.028068 0.134467 0.446198
O  6.229849 1.358601 -1.380985
O  2.611359 -4.371138 -0.030139
O  -4.164953 -2.46255 0.873084
O  -4.646654 -0.670757 -1.701523
O  4.596404 1.992618 -2.904484
O  0.938538 -3.49842 1.317855
C  -1.271051 0.645957 -0.196222
C  1.45877 0.532478 -0.117074
C  -1.15011 1.807393 0.835465
C  1.372103 1.700213 0.906044
C  0.091443 1.674738 1.758152
C  0.099479 0.254913 -0.825021
C  -1.841439 -0.61423 0.566333
C  -2.189026 1.108101 -1.38322
C  2.50906 0.875379 -1.222325
C  1.841601 -0.792134 0.64862
C  0.102838 2.800469 2.781171
C  -2.006373 -1.91765 -0.253159
C  -3.661101 1.479798 -1.03756
C  3.94173 1.078251 -0.691716
C  2.152821 -2.013615 -0.246386
C  -3.113084 -2.810146 0.276097
C  -4.498619 0.227583 -0.838908
C  4.895155 1.521965 -1.786305
C  1.822475 -3.320268 0.446944
H  -1.073899 2.771448 0.293146
H  -2.067554 1.845744 1.449565
H  2.258972 1.677932 1.566577
H  1.410658 2.66923 0.371014
H  0.011974 0.731822 2.332505
H  -1.197858 -0.836303 1.437889
H  -2.81636 -0.312166 0.986842
H  -1.712169 1.999607 -1.835259
H  -2.194097 0.334756 -2.170551
H  2.503527 0.082365 -1.989009
H  2.191477 1.79644 -1.746183
H  2.719175 -0.567917 1.285426
H  1.028512 -1.073362 1.342393
H  -1.078056 -2.510258 -0.280298
H  -2.269947 -1.69808 -1.305856
H  -4.074343 2.02537 -1.905808
H  -3.739007 2.132527 -0.153548
H  4.356854 0.164073 -0.230771
H  3.977106 1.85955 0.093309
H  3.203524 -2.042267 -0.580226
H  1.536838 -1.978164 -1.169355
H  -0.908917 3.394384 4.366974
H  -3.641763 -4.699262 0.296017
H  -5.231369 -0.828403 0.650409
H  6.833655 1.684507 -2.103007
H  2.326427 -5.221453 0.404005
