program: Gaussian 09
title: 000223118
version: EM64L-G09RevD.01
frameworkgroup: C1[X(C9H12FN)]
method: RPBEPBE
basis: SDD
operation: Freq
keyword: #p
keyword: freq=noraman
keyword: PBEPBE/SDD
title: #p freq=noraman PBEPBE/SDD
converged: YES YES NO NO
title: Mulliken charges:
elementType: F N C C C C C C C C C H H H H H H H H H H H H
charge: -0.211435 -0.701305 0.153712 0.367763 0.195943 0.320428 0.019877 -0.617715 -0.839777 -0.858566 -0.798095 0.234132 0.223897 0.224271 0.268744 0.223292 0.239588 0.223089 0.235798 0.235846 0.214948 0.322837 0.322728
chargesum: 0.00000
title: Mulliken charges with hydrogens summed into heavy atoms:
elementType: F N C C C C C C C C C
charge: -0.211435 -0.055741 0.153712 0.367763 0.195943 0.320428 0.019877 -0.383583 -0.122866 -0.172597 -0.111502
polarizability: 1.34899589e+02 5.83936522e+00 1.21918435e+02 3.67121540e-03 -3.66548569e-03 5.85626928e+01
1716.lowfreq: -10.5822 -3.4099 -0.0005 0.0003 0.0009 5.9192 80.3894 114.2959 134.0573
frequency: 80.3757 114.2597 134.0527 157.9125 166.7126 190.6248 254.6462 281.7053 290.9084 308.6264 318.8206 325.9480 350.6670 398.7259 438.0298 474.7646 518.8506 562.6189 574.5089 636.0828 682.7481 751.8970 822.2864 880.1816 924.9647 994.7427 1011.7652 1037.2372 1039.4511 1042.4725 1049.1482 1085.4974 1125.1163 1222.8720 1275.9855 1352.6353 1382.7086 1394.1539 1401.9731 1402.4899 1431.0458 1457.2719 1462.2508 1475.3144 1479.0460 1483.5826 1493.3919 1502.8722 1597.5970 1628.3988 1648.6123 2947.8182 2956.9378 2979.5599 3012.8071 3023.1281 3055.8214 3081.8265 3086.3358 3109.6197 3121.6306 3580.3192 3718.7005
redmass: 1.0422 2.7767 2.9580 1.2101 1.9053 1.2694 2.8207 2.5907 2.2790 4.5359 1.3960 3.2186 2.9185 1.3238 6.0090 6.4623 3.2697 4.2157 2.8387 6.2788 5.5593 4.5099 2.7554 1.3022 2.4537 1.4439 1.6933 1.8602 1.4742 1.4748 1.5119 3.9825 1.9548 1.9659 2.3318 6.7739 3.5552 1.3195 1.4162 1.2660 2.4908 1.4279 1.0450 1.0444 1.0974 1.0454 1.3531 2.3073 7.1734 1.3877 3.6850 1.0397 1.0405 1.0367 1.0975 1.0979 1.0977 1.0950 1.0992 1.0937 1.0914 1.0447 1.1035
irintensity: 0.4464 2.2501 0.1330 1.0825 3.6866 0.2856 2.4817 0.9112 21.6368 2.2114 246.1003 2.2315 3.0921 2.3146 2.3577 4.4586 0.3747 0.2974 2.5536 0.1755 2.7715 7.8202 4.8429 12.8818 4.9416 6.7885 19.8527 7.6347 1.1465 0.0120 11.1238 92.0088 15.3612 8.8608 9.4724 19.1294 9.3830 9.4994 20.7887 4.0949 1.0379 21.2826 10.9772 15.8458 0.7643 13.6524 45.2767 109.5558 9.8782 58.5813 159.1896 52.7996 42.2128 45.4238 29.4492 27.5922 21.5981 14.9497 19.2782 5.1160 17.9670 50.9337 25.4657
temp: 298.150 k
press: 1.00000 atm
elementType: 9 7 6 6 6 6 6 6 6 6 6 1 1 1 1 1 1 1 1 1 1 1 1
symmnumber: 1
zpe: 495212.4 jmol-1
zpe.correction: 0.188616 hartree
zpe.thermalcorrener: 0.200628 hartree
zpe.thermalcorrenthalpy: 0.201572 hartree
zpe.thermalcorrgfe: 0.151767 hartree
zpe.sumelectzpe: -503.944592 hartree
zpe.sumelectthermal: -503.932581 hartree
zpe.sumelectthermalent: -503.931636 hartree
zpe.sumelectthermalfe: -503.981442 hartree
dipole: 3.4009 0.0204 0.0050
dipole: 3.4010
quadrupole: -59.0543 -58.3846 -69.1372
quadrupole: 5.4049 0.0151 0.0081
quadrupole: 3.1378 3.8074 -6.9452 5.4049 0.0151 0.0081
hfenergy: -504.1332086 hartree
pointgroup: C01 [X(C9H12F1N1)]
dipole: 1.3370331 0.0519191 0.0063257 debye
dipolederiv: -0.8566101 0.3167803 -0.0044751 0.3541426 -0.4513655 0.0031353 -0.0046529 0.0029726 -0.1497532 -1.1204766 -0.5242707 0.0019716 -0.5444081 -0.4884506 -0.0030145 0.0032045 -0.0022121 -0.7018552 -0.3843461 -0.2247803 0.0002892 0.0555807 0.102258 -0.0011548 -0.001439 -0.0024036 -0.0964259 -0.0343961 -0.0751132 0.0004976 -0.4837403 -0.0876941 -0.0016863 0.0030611 -0.0005896 -0.080018 1.0124356 0.6277582 -0.0000462 0.6680472 0.2594495 0.0013389 -0.000171 0.0013392 0.0693443 -0.0514549 0.1271931 -0.0008434 0.2412577 -0.2747542 0.0021278 -0.0019605 0.0014046 -0.0641998 0.839955 -0.1469234 0.0037142 -0.3733308 0.6152031 -0.004929 0.0051633 -0.0040086 0.03542 0.1982971 -0.1000167 0.0020312 0.0500388 0.0346778 -0.0011758 0.0011603 -0.0016031 -0.1943451 0.0038716 -0.007259 -0.0001505 0.0109712 -0.0598737 0.0012423 -0.0003213 0.0015135 0.1193199 -0.0287328 0.0272895 -0.0005315 0.039965 0.038788 0.0003732 -0.0009373 0.0006053 0.1111871 -0.0390986 -0.0386617 -0.0002847 0.0028905 0.1051827 -0.0000154 -0.0001115 0.0001292 0.0941305 0.0824318 0.0026329 -0.000202 -0.0005898 -0.1262293 0.0015543 -0.0001669 0.0014598 0.1458842 0.0484789 -0.0911042 -0.1134227 -0.0226465 -0.0270183 -0.0409543 -0.0795531 -0.1001301 -0.0544518 0.0479003 -0.0898094 0.1147816 -0.0216691 -0.0252161 0.0404246 0.0801653 0.0990907 -0.0550978 -0.0378246 0.1283428 -0.0011177 0.0250945 0.0851297 0.0002827 -0.0005247 0.000559 0.1183169 -0.0679097 0.0430061 -0.0980622 -0.029102 0.069984 -0.0758046 -0.1371893 -0.0129219 -0.0603272 0.0868206 -0.0907644 0.0001435 0.026882 -0.1362521 0.0006932 -0.0001697 0.0003326 0.1091076 -0.06978 0.0430397 0.0974481 -0.0296121 0.0705058 0.0751742 0.137079 0.0126168 -0.0583426 -0.0478572 -0.0367208 0.0887241 -0.0015347 0.0664884 -0.0640014 0.14254 -0.009687 -0.0455008 -0.046381 -0.0373008 -0.0883108 -0.0027431 0.0671573 0.0631581 -0.1423746 0.0085623 -0.0469144 0.0677806 0.0802994 -0.0003984 -0.0318494 -0.1553791 0.0009232 0.0000164 0.0012813 0.103843 0.1920867 0.0489215 -0.0010985 0.0274363 0.167914 0.0012357 -0.0014486 0.0013359 0.3496371 0.2048093 0.0174608 -0.0006576 0.0389194 0.1494948 0.0010725 -0.0013693 0.0003533 0.3510417 unknown
polarizability: 134.5019849|6.2536626|122.3130079|0.2317732|-0.3642441|58.5657235 unknown
InChI: InChI=1S/C9H12FN/c1-5-4-6(2)9(11)7(3)8(5)10/h4H,11H2,1-3H3
charge 0 multiplicity 1
23 atoms
F  -2.411759 1.141854 -0.016962
N  2.448728 1.145363 0.001087
C  0.004749 1.178082 -0.008527
C  1.22716 -0.98227 0.008674
C  1.234745 0.448376 0.000616
C  -1.259055 -0.982994 0.000276
C  -1.181442 0.423887 -0.008164
C  -0.013417 -1.657237 0.008361
C  -0.009967 2.692345 -0.018326
C  2.536084 -1.75006 0.017123
C  -2.588892 -1.708196 0.000303
H  -0.014551 -2.754245 0.014542
H  0.495911 3.110378 0.875416
H  0.50015 3.098457 -0.914978
H  -1.041834 3.074567 -0.02283
H  3.147949 -1.519125 0.91359
H  2.355576 -2.83787 0.019022
H  3.156745 -1.523279 -0.874156
H  -3.197578 -1.443683 0.884879
H  -3.193809 -1.450621 -0.888858
H  -2.435678 -2.800946 0.004991
H  3.331967 0.646519 0.008468
H  2.467419 2.1597 -0.003346
