program: Gaussian 09
title: 000018915
version: EM64L-G09RevD.01
frameworkgroup: C1[X(C11H20O3)]
method: RPBEPBE
basis: SDD
operation: Freq
keyword: #pfreq=noraman
keyword: PBEPBE/SDD
title: #p freq=noraman PBEPBE/SDD
converged: YES YES NO NO
title: Mulliken charges:
elementType: O O O C C C C C C C C C C C H H H H H H H H H H H H H H H H H H H H
charge: -0.267301 -0.239724 -0.193981 -0.384271 -0.366129 -0.367430 -0.377698 -0.371245 -0.516110 -0.449759 0.236417 -0.068125 -0.226100 -0.672839 0.198696 0.199266 0.190002 0.189183 0.188374 0.188539 0.220480 0.213892 0.216479 0.216709 0.243076 0.244920 0.231192 0.231238 0.168762 0.226867 0.227078 0.229137 0.229291 0.211112
chargesum: 0.00000
title: Mulliken charges with hydrogens summed into heavy atoms:
elementType: O O O C C C C C C C C C C C
charge: -0.267301 -0.239724 -0.193981 0.013692 0.013056 0.009484 0.056674 0.061943 -0.028115 0.012671 0.236417 0.100637 0.227845 -0.003299
polarizability: 1.73205494e+02 -3.12597609e+00 1.19566958e+02 -6.63986969e-01 -5.76867909e-01 9.38596737e+01
1716.lowfreq: -7.4606 -0.0005 0.0008 0.0010 3.5280 6.2081 16.9932 31.6406 32.9870
frequency: 8.8344 30.8399 32.6773 36.2233 54.7321 77.4284 84.5916 86.2592 126.7914 140.5190 145.9430 155.8403 166.2603 172.7864 241.0184 252.1776 283.5517 341.4336 394.8978 420.6681 489.3047 548.7311 660.3689 675.1538 686.3463 723.0650 732.7454 777.4071 798.6469 813.0670 846.3944 888.4781 908.1575 917.6433 991.3697 1006.0269 1019.5470 1026.5767 1066.2932 1075.5655 1081.5514 1098.9733 1107.7167 1113.5853 1126.3730 1131.0064 1136.2142 1202.7529 1212.9946 1241.3513 1248.4086 1254.2525 1273.6219 1280.8470 1292.6219 1295.0297 1296.7747 1328.4811 1350.8251 1358.3497 1360.0154 1367.7758 1378.9884 1400.6737 1425.1328 1439.6558 1462.0093 1463.8337 1463.8691 1468.6467 1474.4998 1478.6335 1487.2154 1487.5521 1641.0879 1645.5796 2846.8428 2945.3935 2949.1301 2951.5009 2964.2454 2983.0874 2984.0749 2987.2614 2992.6056 2995.1283 2995.2493 2996.9102 3008.9202 3025.4881 3033.1181 3054.7619 3062.4922 3066.9455 3091.6578 3106.8464
redmass: 4.6474 3.4849 4.5315 2.6526 2.9046 2.2638 2.9087 2.6878 2.1231 1.9729 5.3050 2.1534 4.4144 1.7485 4.3896 1.2635 4.8075 3.9553 3.5811 3.7602 3.3109 2.6683 1.1531 5.8049 4.9654 1.0718 1.1427 1.2590 1.0997 3.5754 1.3198 3.3447 5.4774 1.3135 1.2509 3.8251 3.5080 2.6293 2.9637 2.6070 2.0267 3.4318 1.6158 2.2629 1.6991 2.4443 1.4696 1.5241 1.3221 1.3018 1.1361 1.4069 1.1642 1.0427 1.4435 1.0942 1.1142 1.5064 1.4547 1.5165 1.6733 1.6937 1.2352 1.2679 1.1036 1.0858 1.0758 1.0452 1.0589 1.0869 1.0587 1.0964 1.0790 1.0907 9.7491 7.5221 1.0837 1.0616 1.0591 1.0589 1.0593 1.0955 1.0619 1.0973 1.0601 1.0470 1.0531 1.0960 1.0582 1.1016 1.1008 1.1034 1.1031 1.1066 1.0985 1.1025
irintensity: 0.4432 1.1545 0.2469 0.8588 1.0670 0.8782 1.9110 1.6232 4.2875 0.3136 3.9530 4.0401 5.3731 1.6342 0.4063 1.5255 10.9840 11.0919 1.4979 0.1157 3.5839 1.6300 11.1311 5.1169 5.9239 13.6742 0.9400 1.5381 3.9727 4.3487 1.2833 21.6535 12.1825 0.5539 0.3192 5.3777 7.3702 59.4342 46.3383 0.3199 3.7211 63.5676 8.7900 3.1731 52.2353 202.7499 7.3361 0.0352 86.2630 0.2057 0.0039 7.3256 0.2758 0.1637 63.4268 0.3747 1.0794 4.8607 16.9411 6.5950 0.0532 11.5993 6.7086 18.2669 31.8661 23.3222 0.2162 9.5910 2.6437 4.0250 5.2247 0.6893 0.5639 38.6971 154.5049 135.2964 168.8306 27.9162 5.0946 30.5336 60.9321 12.3313 4.3980 3.4554 23.8130 9.0173 55.0650 5.5110 21.3614 20.9048 10.3370 52.7261 98.1921 13.4842 31.3494 46.9525
temp: 298.150 k
press: 1.00000 atm
elementType: 8 8 8 6 6 6 6 6 6 6 6 6 6 6 1 1 1 1 1 1 1 1 1 1 1 1 1 1 1 1 1 1 1 1
symmnumber: 1
zpe: 764550.9 jmol-1
zpe.correction: 0.291202 hartree
zpe.thermalcorrener: 0.309028 hartree
zpe.thermalcorrenthalpy: 0.309972 hartree
zpe.thermalcorrgfe: 0.240687 hartree
zpe.sumelectzpe: -655.697291 hartree
zpe.sumelectthermal: -655.679465 hartree
zpe.sumelectthermalent: -655.678521 hartree
zpe.sumelectthermalfe: -655.747806 hartree
dipole: 1.8364 -4.4556 0.1440
dipole: 4.8214
quadrupole: -85.6837 -94.5764 -83.3069
quadrupole: 15.9178 -2.1045 -0.1005
quadrupole: 2.1720 -6.7207 4.5488 15.9178 -2.1045 -0.1005
hfenergy: -655.9884927 hartree
pointgroup: C01 [X(C11H20O3)]
dipole: -0.7231626 -1.7534696 0.0221602 debye
polarizability: 173.2130981|3.0773599|119.5626866|-0.4543962|-0.612547|93.8563417 unknown
InChI: InChI=1S/C11H20O3/c1-2-14-11(13)9-7-5-3-4-6-8-10-12/h10H,2-9H2,1H3
charge 0 multiplicity 1
34 atoms
O  -4.668098 -0.422553 0.022676
O  -3.548288 1.606521 -0.222608
O  6.901024 1.130758 0.091209
C  1.611229 0.178385 -0.00416
C  0.286756 -0.616587 -0.036676
C  2.863671 -0.726426 -0.013444
C  -0.960698 0.293528 -0.029467
C  4.185049 0.072407 0.020474
C  -2.271573 -0.515512 -0.058805
C  5.425131 -0.839494 0.009501
C  -3.513898 0.360761 -0.096548
C  6.758509 -0.114704 0.047629
C  -5.969867 0.313974 -0.019903
C  -7.071561 -0.732781 0.111032
H  1.630755 0.82253 0.89923
H  1.648152 0.865123 -0.87499
H  0.25157 -1.303221 0.83544
H  0.270012 -1.261028 -0.941039
H  2.823521 -1.413927 0.857926
H  2.842074 -1.370031 -0.918335
H  -0.933744 0.978409 -0.898201
H  -0.947565 0.940899 0.86863
H  4.232306 0.762021 -0.844356
H  4.214567 0.71664 0.920335
H  -2.29983 -1.17975 -0.946057
H  -2.348108 -1.187634 0.817529
H  5.41061 -1.544951 0.869999
H  5.432455 -1.495226 -0.8894
H  7.65663 -0.78856 0.03461
H  -6.023965 0.870894 -0.972983
H  -5.980636 1.047893 0.806271
H  -7.024108 -1.460278 -0.717287
H  -6.980658 -1.283515 1.062859
H  -8.061222 -0.241066 0.086312
