program: Gaussian 09
title: 000223113
version: EM64L-G09RevD.01
frameworkgroup: C1[X(C9H7F4NO)]
method: RPBEPBE
basis: SDD
operation: Freq
keyword: #p
keyword: freq=noraman
keyword: PBEPBE/SDD
title: #p freq=noraman PBEPBE/SDD
converged: NO YES NO NO
title: Mulliken charges:
elementType: F F F F O N C C C C C C C C C H H H H H H H
charge: -0.193291 -0.168005 -0.161601 -0.161600 -0.244536 -0.456808 0.388673 0.575491 -0.639725 -0.500831 -0.507217 0.399782 0.261704 0.229741 -0.796577 0.260563 0.290645 0.343320 0.322681 0.241591 0.274511 0.241491
chargesum: 0.00000
title: Mulliken charges with hydrogens summed into heavy atoms:
elementType: F F F F O N C C C C C C C C C
charge: -0.193291 -0.168005 -0.161601 -0.161600 -0.244536 -0.134127 0.388673 0.575491 -0.379162 -0.210187 -0.163897 0.399782 0.261704 0.229741 -0.038985
polarizability: 1.59530885e+02 -9.97915581e+00 1.20162031e+02 1.15154779e-03 -7.94585080e-05 5.60088892e+01
1716.lowfreq: -69.9250 -11.3767 -6.8357 -6.0659 -1.9247 -0.0005 0.0006 0.0008 56.0986
frequency: -69.9237 -9.7554 56.0877 76.5430 107.5007 123.5475 168.3546 229.1780 242.5169 250.3834 286.4531 308.3648 329.5119 374.0665 439.9710 452.6865 498.9007 519.0492 554.3820 563.0301 603.9182 616.2735 618.8318 661.5837 693.1239 696.1202 829.6124 862.0469 889.6279 927.1157 927.4072 953.1431 983.2565 990.5882 1001.8244 1033.5253 1048.0451 1080.6745 1133.1670 1205.1271 1240.2437 1266.2297 1337.9532 1376.7190 1395.7748 1425.2072 1450.9467 1466.8094 1474.7724 1522.5038 1607.2319 1629.3941 1642.3600 2989.2144 3074.6512 3140.1290 3153.5713 3186.0096 3196.1185 3527.2807
redmass: 1.0476 14.7444 8.2379 3.9951 6.6095 7.4171 9.6432 5.5553 13.9646 3.8936 5.3413 8.0094 8.3089 7.1655 8.1714 11.3807 7.8556 5.4554 6.1577 3.2966 4.5806 2.5076 13.0583 1.5487 2.1404 6.1201 8.3532 1.5225 1.5673 1.4357 5.6391 2.7560 5.8713 11.5822 2.6417 1.6746 5.9616 2.3039 1.7324 2.3629 2.1461 1.2958 5.9902 1.2319 4.9386 3.4679 1.2032 1.0464 4.1321 2.1147 6.1828 6.4941 5.4646 1.0385 1.0984 1.0980 1.0921 1.0941 1.0938 1.0768
irintensity: 0.0495 0.0304 9.8675 2.1359 5.0813 0.2146 0.6515 0.4701 1.2435 0.8731 3.1021 0.1079 1.0154 12.3635 0.6266 2.2481 3.0760 17.5928 3.7661 1.8005 1.1641 21.2947 12.2458 46.2298 27.7724 1.5915 51.6494 24.2132 70.0781 40.6533 33.5091 24.7699 2.0725 220.4189 205.8246 8.9109 37.2432 59.6556 54.3048 197.1662 69.5275 35.3386 196.5910 50.6501 206.8363 28.2193 31.0069 21.3571 125.8306 348.2220 83.4030 99.0623 104.8129 5.6149 12.2384 5.3697 2.8217 3.1932 22.9507 17.0299
temp: 298.150 k
press: 1.00000 atm
elementType: 9 9 9 9 8 7 6 6 6 6 6 6 6 6 6 1 1 1 1 1 1 1
symmnumber: 1
zpe: 385428.8 jmol-1
zpe.correction: 0.146802 hartree
zpe.thermalcorrener: 0.159144 hartree
zpe.thermalcorrenthalpy: 0.160088 hartree
zpe.thermalcorrgfe: 0.107480 hartree
zpe.sumelectzpe: -875.433427 hartree
zpe.sumelectthermal: -875.421085 hartree
zpe.sumelectthermalent: -875.420140 hartree
zpe.sumelectthermalfe: -875.472749 hartree
dipole: 2.8267 -4.1917 0.0000
dipole: 5.0557
quadrupole: -92.6308 -84.2003 -87.1160
quadrupole: -18.4047 0.0003 -0.0002
quadrupole: -4.6484 3.7820 0.8664 -18.4047 0.0003 -0.0002
hfenergy: -875.5802286 hartree
pointgroup: C01 [X(C9H7F4N1O1)]
dipole: 1.0800354 -1.6703051 0.0005279 debye
dipolederiv: -0.2103314 -0.0494141 0.0000376 0.0183824 -1.0838103 0.0004291 0.0000045 0.0004441 -0.1502127 -0.4466557 -0.0798668 0.0000747 -0.074053 -0.8034848 0.0002755 0.0000704 0.0002747 -0.2862828 -0.7344975 -0.0308747 0.2655981 -0.0107885 -0.3115585 -0.0937806 0.2746558 -0.0739102 -0.6314209 -0.7347598 -0.0311052 -0.2655258 -0.0110193 -0.311396 0.09347 -0.2746074 0.0736078 -0.6313369 -0.8704861 0.0346712 0.0000987 -0.4975565 -0.7345848 0.0002971 0.0002404 0.0001922 -0.3302818 -1.9614 0.3874891 0.0001374 0.2663786 -0.4068271 -0.0000465 0.0002102 -0.0000503 -0.3351344 -0.2317408 -0.2217552 0.000127 -0.2727465 0.1086805 -0.0000427 0.0001509 -0.0000539 -0.1330816 1.0762463 -0.4834835 -0.0000186 -0.7305256 0.3899573 0.0000491 0.0000504 0.0000184 0.1346011 -0.3750602 0.2720592 -0.0000854 -0.0895714 -0.0759334 -0.0000284 0.0000958 -0.000119 -0.1885855 -0.2192198 -0.1984629 0.0001056 0.1399793 -0.3105294 0.000045 -0.0000492 0.0001283 -0.1438388 -0.253105 0.1570831 -0.0000546 0.2556582 -0.3456269 0.0000287 -0.0000955 0.0000485 -0.1630827 0.3654525 0.1036732 -0.0001094 -0.0682657 1.3323316 -0.000549 -0.0000195 -0.0005881 0.1181991 2.103089 0.2514172 -0.0002446 0.2865802 1.4222081 -0.0000114 -0.000259 -0.0000012 1.5462981 2.1211697 -0.2135276 -0.0002242 0.5053154 0.9383057 -0.0005077 -0.000323 -0.0004574 0.1796474 -0.2382255 0.177713 0.0000055 0.3068687 -0.2932584 0.0002393 -0.0003958 0.0004923 0.0504218 0.117786 0.0366598 0.0000004 0.0323683 -0.0266594 0.0000855 0.0000019 0.0000822 0.1762507 0.0586382 0.0429734 0.0000127 0.0293105 0.0968202 0.000034 0.0000203 0.0000299 0.1875841 0.1830631 -0.0663197 0.0000404 -0.0261428 0.1443385 0.0000311 0.0000218 0.0000391 0.2024304 0.1580864 -0.0451298 0.0000529 -0.0106829 0.1225814 0.0000765 0.0000598 0.0000612 0.3087945 0.0695719 -0.0132863 0.0684472 0.0166449 0.0351292 0.0828646 0.0243125 0.1045088 -0.0232247 -0.047017 -0.0167989 0.0002087 -0.0825332 0.0786895 0.0001372 0.0003387 0.0000075 0.1349171 0.0693959 -0.0137146 -0.0686843 0.016399 0.0346271 -0.0830965 -0.0244842 -0.104755 -0.0226613 unknown
polarizability: 159.1307439|-10.7320332|120.5621548|-0.0173786|-0.0281569|56.0089063 unknown
InChI: InChI=1S/C9H7F4NO/c1-5(15)14-8-3-6(9(11,12)13)2-7(10)4-8/h2-4,14H,1H3
charge 0 multiplicity 1
22 atoms
F  -0.069254 3.335338 -0.001572
F  -2.724628 -2.15034 0.001664
F  -3.592291 -0.38251 1.131905
F  -3.592824 -0.383633 -1.129922
O  3.859382 0.559888 -0.001116
N  2.131696 -1.029578 -0.00015
C  -1.463427 -0.069531 0.000339
C  0.981735 -0.201893 -0.000216
C  -0.287932 -0.842095 0.000397
C  -1.418902 1.34437 -0.00032
C  1.057467 1.215111 -0.000882
C  -0.147576 1.934048 -0.000906
C  -2.808707 -0.738124 0.000983
C  3.48358 -0.645667 -0.000565
C  4.453603 -1.82471 -0.000093
H  -0.358986 -1.934807 0.000916
H  -2.322826 1.958526 -0.000373
H  2.022545 1.724636 -0.001357
H  1.951806 -2.036619 0.000295
H  4.314909 -2.456894 0.896467
H  5.480709 -1.434045 -0.001519
H  4.313224 -2.459173 -0.894775
