program: Gaussian 09
title: 000223109
version: EM64L-G09RevD.01
frameworkgroup: C1[X(C8H7F2NO)]
method: RPBEPBE
basis: SDD
operation: Freq
keyword: #p
keyword: freq=noraman
keyword: PBEPBE/SDD
title: #p freq=noraman PBEPBE/SDD
converged: YES YES NO NO
title: Mulliken charges:
elementType: F F O N C C C C C C C C H H H H H H H
charge: -0.179893 -0.180110 -0.251100 -0.446720 0.549468 -0.461934 -0.443569 0.220131 -0.290050 0.161079 0.224543 -0.797126 0.340065 0.229006 0.314803 0.260582 0.238912 0.273030 0.238883
chargesum: 0.00000
title: Mulliken charges with hydrogens summed into heavy atoms:
elementType: F F O N C C C C C C C C
charge: -0.179893 -0.180110 -0.251100 -0.131917 0.549468 -0.121869 -0.214563 0.220131 -0.029468 0.161079 0.224543 -0.046301
polarizability: 1.47576134e+02 3.25201068e+00 1.03196506e+02 3.18103698e-04 -1.08085098e-04 4.46088134e+01
1716.lowfreq: -77.6937 -7.8768 -5.0035 0.0001 0.0004 0.0011 7.9630 61.7595 74.1746
frequency: -77.6746 61.7563 74.1731 136.9281 164.4490 233.2413 262.6527 294.5573 306.0720 358.7142 441.3314 448.6509 502.9503 547.7870 569.8853 615.3871 624.2598 636.2540 699.9132 731.4482 766.5368 799.3196 902.3178 919.4270 927.0300 939.1946 994.4403 1032.0959 1091.0840 1147.9293 1188.9215 1229.3661 1248.0619 1282.6896 1376.8690 1385.5986 1418.8069 1447.8266 1467.6054 1492.7756 1512.2768 1604.6574 1626.4166 1637.0260 2988.6744 3073.8206 3133.0955 3139.0598 3178.7866 3193.7475 3527.6083
redmass: 1.0480 8.4243 4.1203 6.1657 5.8444 5.9577 15.2928 6.0584 5.6596 5.6686 6.4235 3.2374 4.5371 8.1668 3.2382 3.4584 5.5931 1.2263 3.7409 6.6735 5.7431 1.4498 1.4333 1.3225 5.7774 2.8992 1.7323 1.6622 3.3913 1.5860 1.6910 2.7252 1.6068 2.7791 1.2624 8.4553 5.1204 1.1536 1.0466 2.2829 2.5880 7.1907 7.1962 5.1865 1.0385 1.0984 1.0905 1.0979 1.0951 1.0932 1.0767
irintensity: 0.0182 6.1802 2.0824 2.9595 0.0594 0.0042 0.4717 3.8539 0.1586 0.5542 2.0051 8.7970 22.1653 3.6167 6.4942 16.5425 1.0179 56.9488 0.3769 23.9879 24.7876 65.0288 44.1856 6.7367 5.5899 16.2057 38.4850 8.5885 32.8203 1.5077 32.7989 176.2226 14.2199 12.4303 43.6676 85.3687 109.4955 28.6295 20.6958 27.8153 537.9832 54.0332 29.3775 114.0610 7.3389 14.0604 11.1400 5.7417 0.8701 23.9266 14.5110
temp: 298.150 k
press: 1.00000 atm
elementType: 9 9 8 7 6 6 6 6 6 6 6 6 1 1 1 1 1 1 1
symmnumber: 1
zpe: 355192.1 jmol-1
zpe.correction: 0.135286 hartree
zpe.thermalcorrener: 0.145544 hartree
zpe.thermalcorrenthalpy: 0.146488 hartree
zpe.thermalcorrgfe: 0.098853 hartree
zpe.sumelectzpe: -637.849890 hartree
zpe.sumelectthermal: -637.839632 hartree
zpe.sumelectthermalent: -637.838688 hartree
zpe.sumelectthermalfe: -637.886323 hartree
dipole: 3.8822 -5.7045 -0.0002
dipole: 6.9002
quadrupole: -68.4810 -66.8097 -69.7427
quadrupole: -5.4681 -0.0004 -0.0004
quadrupole: -0.1366 1.5348 -1.3982 -5.4681 -0.0004 -0.0004
hfenergy: -637.9851758 hartree
pointgroup: C01 [X(C8H7F2N1O1)]
dipole: 1.4630699 -2.2867563 0.005472 debye
dipolederiv: -0.3760598 0.2924095 -0.0006937 0.4271173 -0.8595179 0.0017942 -0.0010433 0.0018236 -0.1244496 -1.2021896 0.0721391 0.0000632 0.0862584 -0.1802765 0.0001557 0.0000314 0.0001553 -0.1123873 -0.6427716 0.0872763 -0.0001423 -0.4690944 -0.9583443 0.0016922 0.0012435 0.0015447 -0.3361064 -1.760009 -0.3333877 0.0011853 -0.4936957 -0.4544166 0.0004239 0.0016213 0.0004138 -0.3320317 1.2386504 0.0096687 -0.0002864 -0.1987116 0.042631 0.0002159 0.0002201 0.0001584 0.1095737 -0.3677198 0.0662821 -0.0001236 0.1594172 -0.1427226 -0.0001054 -0.0003647 -0.0000877 -0.1674656 -0.2717008 0.0498801 -0.000115 -0.1957421 0.0245866 -0.000609 0.0005227 -0.0006663 -0.2269879 0.3915272 -0.2407588 0.0005461 -0.5784524 1.021452 -0.0022537 0.0014236 -0.0023231 0.0939156 -0.006856 -0.0779785 0.0001774 0.1174791 0.0443464 -0.0004472 -0.0003303 -0.0004036 -0.119057 1.1827414 -0.1495458 0.0001241 0.007641 -0.0204414 0.0001447 -0.0002862 0.0001848 0.036801 1.6763518 0.1767597 -0.0008157 0.8984363 1.2914655 -0.0030477 -0.0025997 -0.00288 0.176481 -0.4340842 0.1059233 -0.0001498 0.2297488 -0.083269 0.0003294 -0.0005787 0.0003717 0.0549266 0.2145661 -0.0360382 0.0000923 0.0132895 0.1053603 0.000256 -0.0000311 0.000267 0.2047174 0.0260531 0.1007771 -0.0002271 0.0822225 -0.0447969 0.0005527 -0.0001799 0.0005487 0.1753945 0.1638434 -0.0173965 0.0000807 0.0282801 0.1009751 0.0005179 -0.0000168 0.0005249 0.3078014 0.0413842 -0.060638 0.0001882 -0.0707031 0.0241654 0.0004206 0.0002138 0.0004181 0.1807041 0.0543164 0.0016146 0.0206555 0.0359243 0.0394804 0.1075069 -0.0312077 0.1067012 -0.028366 0.0176243 -0.0484008 0.0001832 -0.1154381 0.0110729 0.0003874 0.0003924 0.0003533 0.1337204 0.0543328 0.0014138 -0.0207424 0.0360229 0.0382496 -0.1079345 0.0309695 -0.1071045 -0.0271843 unknown
polarizability: 147.724869|1.9879941|103.0473759|-0.0288577|-0.1508396|44.6092082 unknown
InChI: InChI=1S/C8H7F2NO/c1-5(12)11-6-2-3-7(9)8(10)4-6/h2-4,11H,1H3
charge 0 multiplicity 1
19 atoms
F  -2.134643 2.136404 -0.005784
F  -3.780657 -0.116834 0.000396
O  2.642952 1.448121 -0.005047
N  1.827387 -0.753352 0.000735
C  0.421793 -0.544116 0.000534
C  -0.156807 0.753584 -0.002692
C  -0.418248 -1.692156 0.003698
C  -1.553545 0.863522 -0.002645
C  -1.820223 -1.554676 0.003659
C  -2.388178 -0.271045 0.000474
C  2.853824 0.20184 -0.00197
C  4.255866 -0.406361 -0.000769
H  0.473095 1.645018 -0.005169
H  0.021126 -2.69635 0.006204
H  2.12475 -1.732018 0.003145
H  -2.476641 -2.42934 0.006067
H  4.421876 -1.030868 0.896624
H  4.991536 0.410066 -0.003332
H  4.421238 -1.035938 -0.894731
