program: Gaussian 09
title: 000223227
version: EM64L-G09RevD.01
frameworkgroup: C1[X(C20H18ClN5O6S2)]
method: RPBEPBE
basis: SDD
operation: Freq
keyword: #p
keyword: freq=noraman
keyword: PBEPBE/SDD
title: #p freq=noraman PBEPBE/SDD
converged: NO YES NO NO
title: Mulliken charges:
elementType: Cl S S O O O O O O N N N N N C C C C C C C C C C C C C C C C C C C C H H H H H H H H H H H H H H H H H H
charge: 0.038928 0.967653 0.960683 -0.513928 -0.468256 -0.502189 -0.489767 -0.245241 -0.247485 -0.428349 0.015810 -0.456000 -0.454376 0.101978 -0.165757 -0.105198 0.287812 -0.213846 -0.157875 -0.199859 -0.187751 0.502615 0.504283 -0.423872 -0.457350 -0.330812 -0.348181 -0.302920 -0.243796 -0.257654 0.233469 0.229502 -0.776296 -0.778182 0.301192 0.307401 0.288863 0.278907 0.237893 0.235129 0.322194 0.318928 0.312751 0.310275 0.252817 0.256402 0.217522 0.264518 0.265246 0.216103 0.263368 0.262697
chargesum: 0.00000
title: Mulliken charges with hydrogens summed into heavy atoms:
elementType: Cl S S O O O O O O N N N N N C C C C C C C C C C C C C C C C C C C C
charge: 0.038928 0.967653 0.960683 -0.513928 -0.468256 -0.502189 -0.489767 -0.245241 -0.247485 -0.428349 0.015810 -0.143249 -0.144101 0.101978 -0.165757 -0.105198 0.287812 0.087347 0.149527 0.089004 0.091156 0.502615 0.504283 -0.185979 -0.222222 -0.008618 -0.029253 -0.302920 0.009021 -0.001252 0.233469 0.229502 -0.029010 -0.036014
polarizability: 4.68409128e+02 3.08738068e+01 3.73762359e+02 -1.54924704e+01 3.81796660e+01 3.08015078e+02
1716.lowfreq: -4.7230 -0.0007 0.0017 0.0019 2.1933 2.7182 8.6777 17.9765 20.4722
frequency: 7.9382 17.9403 20.3717 28.1498 34.3100 46.8909 47.5597 49.9525 55.0221 67.6838 74.8011 75.4871 81.9432 82.7403 85.7614 88.5190 102.7756 106.8643 114.3837 143.3090 156.8555 165.3493 168.0043 178.9391 179.6927 201.5586 215.6654 216.4397 238.9946 279.0801 297.6683 308.6251 312.7690 321.9960 341.8056 350.1464 368.3799 377.1905 382.6219 388.7681 402.5568 413.3373 415.4457 418.4378 434.1768 449.3398 479.0036 515.4549 524.8334 527.9561 544.8803 547.2453 575.3936 595.4666 597.4443 597.9092 616.4014 617.4684 655.6574 658.8460 671.8740 673.4806 689.3741 723.1808 726.5247 775.2756 808.6534 813.0354 823.0838 823.7362 825.4651 836.1652 850.1404 851.2478 863.8892 869.8222 930.0768 930.7345 945.1595 950.1081 957.0737 960.9511 963.9632 979.4865 983.1779 995.2423 996.7156 998.1752 1001.2868 1003.4599 1040.8784 1041.4249 1047.3069 1050.8260 1055.6392 1124.4161 1125.0650 1164.3322 1185.6513 1187.7205 1215.3297 1215.6771 1217.0483 1253.5246 1265.7551 1266.5824 1297.0183 1298.4833 1318.5894 1369.0790 1373.7189 1388.6918 1391.0652 1393.4023 1406.3511 1409.2523 1448.9277 1449.0134 1463.9289 1468.8621 1469.5119 1473.5204 1476.3289 1489.2456 1499.6061 1502.1396 1591.1324 1592.1280 1596.3227 1597.7460 1630.9032 1632.6317 2997.2542 2999.5641 3095.3855 3100.8460 3102.6170 3105.1023 3127.8169 3130.6404 3149.8251 3159.5113 3170.6613 3171.6398 3177.1201 3186.0282 3196.4059 3197.4992 3532.9257 3533.2177
redmass: 7.2851 7.0870 6.7419 7.6789 6.8704 6.7908 2.4162 2.6228 2.3732 3.5556 2.1822 7.3598 3.7733 4.6291 2.4797 4.6468 7.0403 7.5820 7.7282 9.2352 6.9058 6.5175 14.4521 7.2980 7.2521 10.2708 7.2084 7.0251 8.0463 9.6399 6.7141 9.2013 6.5328 9.2405 6.5366 5.8146 5.7335 5.4005 6.5809 9.7481 7.8303 3.0161 3.1947 8.0524 8.0304 8.3358 8.9163 5.6951 3.0812 2.9476 4.5588 4.6053 10.5332 3.7830 3.2006 4.0118 7.0012 6.9944 1.1942 1.1968 6.2483 6.2494 10.5812 3.2067 3.2942 8.7032 13.3155 8.8199 1.9005 4.1884 3.3599 1.4064 3.3318 1.6311 1.4555 1.4419 6.2076 6.3205 1.4843 2.7582 2.4463 10.7709 1.4211 5.4364 5.0623 1.6244 1.6323 1.3455 1.5537 4.0368 1.6402 1.6398 2.3502 2.3893 2.7399 1.3037 1.3181 3.3018 1.1293 1.1278 3.3958 3.3798 4.6810 5.1771 1.9364 1.8925 1.3884 1.4171 2.8139 3.9901 3.9481 1.7896 1.2341 1.2249 4.6981 4.6709 1.0446 1.0476 4.2349 1.2810 1.1645 1.7558 2.0390 6.5042 2.2514 2.2762 6.7486 6.2011 6.1685 5.5372 4.8654 4.8947 1.0364 1.0363 1.0993 1.0979 1.1008 1.0993 1.0910 1.0905 1.0891 1.0914 1.0952 1.0904 1.0989 1.0948 1.0952 1.0958 1.0766 1.0767
irintensity: 0.1190 1.6916 1.0062 0.7971 3.9035 4.6891 4.9417 4.3454 0.3566 0.6425 2.0849 0.5593 0.3364 1.8182 0.1467 2.2683 3.6891 2.3834 0.1440 1.8848 2.3877 8.6822 1.9303 3.8203 6.5925 2.3633 3.3531 4.2699 13.6897 23.0212 33.6193 3.6831 8.5392 40.2164 11.8923 41.9480 4.1075 0.8537 0.9339 25.7360 105.0331 2.4681 3.8555 25.8335 106.0179 33.0002 4.8043 8.5153 119.5748 51.4626 58.6859 45.9846 18.6551 19.3584 6.0884 51.9482 1.6727 2.6499 50.9755 51.5345 2.7722 4.0489 15.6861 0.4637 0.1684 2.7838 54.2062 90.1199 42.6456 5.5795 14.0457 21.6439 11.5318 27.5130 65.9035 38.5355 4.4595 3.9171 0.7499 38.2691 28.1298 41.6928 6.4744 6.1411 8.6624 19.2308 16.6883 3.7077 16.5472 63.0808 15.1106 13.8861 45.0974 44.9201 9.9550 10.9044 8.7928 48.4932 67.1276 38.6013 59.8712 98.2445 34.4853 19.7209 68.2266 61.2847 60.1781 65.0166 53.4833 230.4611 305.6094 35.9163 47.3078 52.5135 16.5101 15.0895 15.8121 15.9317 26.6706 16.9355 13.9961 38.4862 40.6141 26.4326 385.4094 530.3436 97.8290 158.4879 13.2130 44.0825 102.6143 96.9348 10.7156 9.2152 12.2700 4.8392 15.4876 9.9474 16.2218 13.5637 1.9895 2.9010 6.5383 4.6581 18.3574 8.4549 12.0593 9.4643 17.3762 20.3346
temp: 298.150 k
press: 1.00000 atm
elementType: 17 16 16 8 8 8 8 8 8 7 7 7 7 7 6 6 6 6 6 6 6 6 6 6 6 6 6 6 6 6 6 6 6 6 1 1 1 1 1 1 1 1 1 1 1 1 1 1 1 1 1 1
symmnumber: 1
zpe: 940322.3 jmol-1
zpe.correction: 0.358150 hartree
zpe.thermalcorrener: 0.392974 hartree
zpe.thermalcorrenthalpy: 0.393919 hartree
zpe.thermalcorrgfe: 0.285796 hartree
zpe.sumelectzpe: -2751.426309 hartree
zpe.sumelectthermal: -2751.391485 hartree
zpe.sumelectthermalent: -2751.390541 hartree
zpe.sumelectthermalfe: -2751.498663 hartree
dipole: -4.1612 10.3554 -0.8648
dipole: 11.1936
quadrupole: -142.9469 -248.5755 -222.5523
quadrupole: 4.6700 -18.2811 -11.0959
quadrupole: 61.7447 -43.8840 -17.8607 4.6700 -18.2811 -11.0959
hfenergy: -2751.7844592 hartree
pointgroup: C01 [X(C20H18Cl1N5O6S2)]
dipole: 2.1043182 -3.3569942 -1.9227191 debye
polarizability: 457.2718527|25.3375106|394.5921219|45.0535572|8.3668578|298.3225903 unknown
InChI: InChI=1S/C20H18ClN5O6S2/c1-13(27)24-15-3-7-17(8-4-15)33(29,30)26(20-19(21)22-11-12-23-20)34(31,32)18-9-5-16(6-10-18)25-14(2)28/h3-12,24-25H,1-2H3
charge 0 multiplicity 1
52 atoms
Cl 2.568388 2.843059 2.934668
S  0.757622 2.615741 -0.612203
S  -2.035238 2.503133 1.256726
O  -0.37198 2.063318 -1.648646
O  1.342137 4.117765 -0.722223
O  -2.382265 2.285101 2.829168
O  -2.25712 3.918058 0.506574
O  4.508989 -3.305959 -1.184771
O  -5.685319 -3.302596 -0.318158
N  -0.003801 2.405351 1.30876
N  -0.226735 0.057046 1.868215
N  5.475818 -1.215021 -0.728252
N  -5.2254 -1.609281 -1.880063
N  2.09741 0.23784 3.459341
C  2.196605 1.409468 -0.627482
C  -2.95583 1.18385 0.279847
C  0.461303 1.243649 1.957313
C  3.484477 1.913978 -0.380212
C  -3.215589 1.425828 -1.078877
C  1.938663 0.059902 -0.922434
C  -3.410602 0.050392 0.970847
C  4.339586 -0.367688 -0.710292
C  -4.461342 -0.69568 -1.108055
C  4.560256 1.011307 -0.428399
C  -3.980705 0.470289 -1.769817
C  3.020097 -0.841853 -0.964888
C  -4.17726 -0.902116 0.272145
C  1.640404 1.295577 2.780835
C  0.221179 -1.008149 2.582973
C  1.393167 -0.929679 3.372755
C  5.531216 -2.600305 -0.952316
C  -5.795612 -2.827935 -1.484778
C  6.932909 -3.197825 -0.892551
C  -6.579967 -3.545918 -2.579264
H  3.63672 2.975964 -0.16658
H  -2.838212 2.32404 -1.573019
H  0.918716 -0.277385 -1.132892
H  -3.184899 -0.074924 2.033451
H  5.576248 1.378495 -0.240275
H  -4.201038 0.6303 -2.832322
H  2.864721 -1.897902 -1.190372
H  -4.55933 -1.79398 0.770756
H  6.370056 -0.754545 -0.54396
H  -5.380147 -1.336574 -2.853312
H  -0.357455 -1.934226 2.512109
H  1.774516 -1.783805 3.938868
H  7.729304 -2.462312 -0.686305
H  6.9568 -3.975894 -0.110361
H  7.149798 -3.696593 -1.852675
H  -6.512365 -3.066627 -3.571217
H  -6.213782 -4.583263 -2.658028
H  -7.64251 -3.597615 -2.283452
