program: Gaussian 09
title: 000223086
version: EM64L-G09RevD.01
frameworkgroup: C1[X(C7H5F3N2O2)]
method: RPBEPBE
basis: SDD
operation: Freq
keyword: #p
keyword: freq=noraman
keyword: PBEPBE/SDD
title: #p freq=noraman PBEPBE/SDD
converged: NO NO NO NO
title: Mulliken charges:
elementType: F F F O O N N C C C C C C C H H H H H
charge: -0.175098 -0.144449 -0.144338 -0.174722 -0.269902 0.022109 -0.662085 0.198302 0.174914 0.366324 -0.358251 0.292298 -0.383095 -0.203359 0.284510 0.236165 0.245543 0.317839 0.377296
chargesum: 0.00000
title: Mulliken charges with hydrogens summed into heavy atoms:
elementType: F F F O O N N C C C C C C C
charge: -0.175098 -0.144449 -0.144338 -0.174722 -0.269902 0.022109 0.033051 0.198302 0.174914 0.366324 -0.073742 0.292298 -0.146930 0.042184
polarizability: 1.33831158e+02 -4.02820609e+00 1.33313900e+02 -1.36109964e-02 -2.48108110e-03 4.61289426e+01
1716.lowfreq: -43.2173 -12.2492 -4.7775 -0.0006 0.0005 0.0008 10.5911 79.0120 117.6510
frequency: -43.1343 79.0082 117.6436 175.9235 196.1025 232.7826 255.7305 313.0512 322.6211 346.3997 387.5057 413.0767 456.2602 484.5264 493.8081 511.6725 539.4273 569.1365 616.4990 627.8401 658.5660 715.2688 715.4001 764.3386 796.6045 802.1756 886.0413 901.5850 976.2929 986.0810 1020.6300 1022.3979 1070.6878 1119.3519 1137.1798 1171.9148 1202.0997 1275.3778 1341.5185 1363.9236 1407.7236 1444.0480 1499.7746 1561.6144 1578.7597 1630.3677 3137.0639 3167.3558 3208.3620 3382.8686 3635.3686
redmass: 11.6968 7.7461 9.9091 6.2468 14.0428 4.9810 14.1428 9.7912 8.0762 11.7286 4.2985 8.7846 6.2153 11.5337 5.1692 1.1670 4.7665 6.9126 5.1425 13.1594 4.9995 9.5801 4.3595 1.2531 9.2187 1.3973 7.4191 1.3921 7.1265 1.3430 11.8276 2.5549 4.3203 3.5692 2.4150 3.2610 1.3404 2.0630 3.9571 3.8654 4.4948 2.8823 3.4977 1.5513 3.7345 6.1071 1.0889 1.0959 1.0941 1.0556 1.0947
irintensity: 0.0368 0.9296 0.0675 0.2611 0.2941 2.0673 5.9664 0.8382 2.2954 1.4950 5.3597 7.2830 2.4701 1.2996 3.6812 119.2292 1.4681 0.7719 4.5599 13.9922 17.8436 6.6955 20.6369 171.7896 9.7209 42.7485 66.0048 6.0712 149.0620 2.5801 228.6865 43.7248 9.4050 77.7569 72.5147 180.4165 56.9947 210.3990 22.6583 197.1483 4.6456 11.5810 65.2005 135.7118 47.5693 144.0089 6.1420 11.9491 1.8227 80.2718 68.1449
temp: 298.150 k
press: 1.00000 atm
elementType: 9 9 9 8 8 7 7 6 6 6 6 6 6 6 1 1 1 1 1
symmnumber: 1
zpe: 315334.2 jmol-1
zpe.correction: 0.120104 hartree
zpe.thermalcorrener: 0.130975 hartree
zpe.thermalcorrenthalpy: 0.131919 hartree
zpe.thermalcorrgfe: 0.083648 hartree
zpe.sumelectzpe: -828.124284 hartree
zpe.sumelectthermal: -828.113414 hartree
zpe.sumelectthermalent: -828.112470 hartree
zpe.sumelectthermalfe: -828.160741 hartree
dipole: -6.0197 5.6798 0.0055
dipole: 8.2763
quadrupole: -68.4788 -79.8914 -81.5188
quadrupole: -3.5799 -0.0106 -0.0229
quadrupole: 8.1508 -3.2617 -4.8891 -3.5799 -0.0106 -0.0229
hfenergy: -828.2443885 hartree
pointgroup: C01 [X(C7H5F3N2O2)]
dipole: -2.6567505 1.8825619 0.0053033 debye
dipolederiv: -0.626088 -0.2585224 0.0003291 -0.2074597 -0.5671095 0.0003954 0.0002053 0.0003909 -0.2938331 -0.56149 0.1050139 -0.1678467 0.0711864 -0.3533242 0.1917447 -0.163035 0.1788573 -0.6226823 -0.5610797 0.1048256 0.1674813 0.0701473 -0.3534699 -0.1916347 0.1621708 -0.1789796 -0.6225133 -0.8114461 0.2706354 -0.000355 0.2101351 -0.5550122 -0.000398 0.0024458 -0.0017854 -0.1779236 -0.5592532 -0.344786 0.0004816 -0.1615717 -0.7699053 0.0003391 -0.0007196 -0.0015831 -0.2803469 1.1557153 -0.1394233 -0.000568 -0.370558 1.6891974 0.001342 -0.0020832 0.0031642 0.1927631 -1.0145367 -0.349213 0.0006757 -0.6035467 -0.4767073 0.0005861 0.000567 0.0002867 -0.6154633 -0.3721105 0.3716335 0.0003744 -0.1170933 0.3975732 0.0003515 0.0000087 0.0002437 -0.1140106 -0.2404815 -0.1483744 0.0002932 0.5466037 -0.8068574 -0.0013925 0.0004982 -0.000093 -0.0001461 0.8529998 0.3222627 -0.0007431 0.780207 0.3968394 -0.0008252 -0.0004753 0.000135 0.1753597 -0.2309033 0.2537827 0.0001611 0.1753659 -0.4376747 -0.000404 -0.0001511 0.0000005 -0.140902 1.9496999 -0.0141828 0.0000666 0.0574267 1.2587327 -0.0003723 0.0008963 -0.0002925 1.540736 -0.0040653 -0.010344 -0.0000932 -0.5323833 -0.1137412 0.0005647 -0.000152 -0.0001305 -0.1825958 0.3718538 -0.3117844 -0.000589 0.0343937 0.1848469 -0.0000549 -0.0003197 0.0002188 -0.0851003 0.0830497 -0.0379924 0.0000754 -0.0491905 0.0643228 0.0000017 0.0001714 -0.0001356 0.1676719 -0.0912398 0.0546112 0.0001882 -0.0056227 0.0746712 -0.0000124 0.0000745 -0.0000674 0.1628194 0.0914706 0.0305847 0.0000469 0.0478685 -0.0668815 -0.000049 0.0000732 0.0000247 0.1524806 0.2609937 0.0486872 0.0000456 0.07468 0.1678407 -0.0000606 0.0002196 -0.0001577 0.36714 0.3069114 0.0525859 -0.000024 -0.0205885 0.266659 -0.0001218 -0.0003949 -0.0000971 0.3765464 unknown
polarizability: 134.933352|-3.8001243|132.2116061|-0.0768193|0.0585648|46.1290424 unknown
InChI: InChI=1S/C7H5F3N2O2/c8-7(9,10)4-2-1-3-5(11)6(4)12(13)14/h1-3H,11H2
charge 0 multiplicity 1
19 atoms
F  2.723916 1.488392 -0.002127
F  2.390072 -0.400611 1.146098
F  2.388063 -0.401666 -1.148064
O  0.871106 -2.203582 -0.004056
O  -1.348549 -2.631725 -0.002603
N  -0.343479 -1.785872 0.000607
N  -3.074766 -0.742789 0.002541
C  0.453589 0.61589 0.000208
C  -0.618973 -0.346526 0.000967
C  -1.995652 0.103013 0.001882
C  0.145924 1.986503 0.000446
C  1.946428 0.289664 -0.000913
C  -2.246727 1.515894 0.002092
C  -1.201893 2.431498 0.001398
H  0.956036 2.715994 -0.000113
H  -3.28798 1.857408 0.002776
H  -1.413877 3.504945 0.001558
H  -4.01694 -0.358005 0.003196
H  -2.889201 -1.753924 0.00241
