program: Gaussian 09
title: 000223069
version: EM64L-G09RevD.01
frameworkgroup: C1[X(C8H6ClFO3)]
method: RPBEPBE
basis: SDD
operation: Freq
keyword: #p
keyword: freq=noraman
keyword: PBEPBE/SDD
title: #p freq=noraman PBEPBE/SDD
converged: YES YES NO NO
title: Mulliken charges:
elementType: Cl F O O O C C C C C C C C H H H H H H
charge: -0.011793 -0.203466 -0.233629 -0.413771 -0.196184 0.514561 -0.273197 -0.271072 -0.370148 -0.396607 -0.393330 0.344220 0.193357 0.242239 0.288555 0.247865 0.284664 0.258971 0.388765
chargesum: 0.00000
title: Mulliken charges with hydrogens summed into heavy atoms:
elementType: Cl F O O O C C C C C C C C
charge: -0.011793 -0.203466 -0.233629 -0.025006 -0.196184 0.514561 -0.273197 -0.028833 -0.085485 0.139812 -0.134359 0.344220 0.193357
polarizability: 1.31066598e+02 -1.48737573e+00 1.17670024e+02 1.15941957e+01 2.58923445e+00 6.02483581e+01
1716.lowfreq: -8.3542 -6.3946 -0.0021 -0.0016 -0.0011 2.5914 27.5969 38.3180 60.3017
frequency: 27.5190 38.2741 60.2721 122.6411 166.0066 180.6904 232.5278 246.9467 306.9442 363.9968 388.4537 426.0616 439.7168 454.0774 491.8365 543.2443 565.8567 621.8038 634.0596 666.8165 702.2194 709.8424 787.9002 828.8615 857.2548 867.2257 910.3354 1003.7188 1007.2357 1025.1476 1062.7345 1142.4231 1165.2465 1224.6506 1244.5632 1256.1639 1268.8670 1358.3035 1371.8874 1401.3195 1446.5024 1476.3354 1589.9921 1611.3071 1691.9721 2995.8865 3090.3211 3161.6467 3185.3803 3188.9082 3521.5537
redmass: 8.8885 8.3512 9.0114 6.6962 8.9211 6.8842 4.6972 9.7482 6.9996 7.6596 9.7578 5.5141 3.2674 6.6412 1.8849 4.6522 3.6785 1.8719 2.8911 7.9348 3.4374 5.8664 1.5297 4.5525 1.4608 7.8383 1.3572 3.6058 2.7004 2.7794 2.7505 1.2793 2.2564 1.4504 1.8475 1.5030 2.2883 1.5577 6.1337 4.8317 1.0869 2.9417 7.8940 7.7117 9.1262 1.0650 1.0962 1.0884 1.0964 1.0938 1.0644
irintensity: 0.2383 0.5741 0.5725 1.8762 1.1915 0.1509 3.7095 1.7846 1.3018 0.3580 3.7578 4.5855 5.9676 23.4257 35.6361 22.7085 5.7502 68.1287 81.0342 6.8211 2.1099 40.8124 45.9807 11.7120 38.9625 50.6826 0.6042 164.2228 46.8102 235.4710 13.3389 8.9911 105.0682 7.3642 80.7440 18.2954 13.0446 15.3045 18.5919 2.4277 35.5163 271.5119 32.5104 3.7420 202.4818 24.5741 4.7441 10.3121 0.9752 1.6001 34.6171
temp: 298.150 k
press: 1.00000 atm
elementType: 17 9 8 8 8 6 6 6 6 6 6 6 6 1 1 1 1 1 1
symmnumber: 1
zpe: 329771.3 jmol-1
zpe.correction: 0.125603 hartree
zpe.thermalcorrener: 0.137636 hartree
zpe.thermalcorrenthalpy: 0.138580 hartree
zpe.thermalcorrgfe: 0.085212 hartree
zpe.sumelectzpe: -1093.056776 hartree
zpe.sumelectthermal: -1093.044744 hartree
zpe.sumelectthermalent: -1093.043800 hartree
zpe.sumelectthermalfe: -1093.097167 hartree
dipole: -3.5839 -1.8173 -1.8675
dipole: 4.4311
quadrupole: -71.4885 -80.0794 -84.3830
quadrupole: 7.2560 1.2994 0.5163
quadrupole: 7.1618 -1.4291 -5.7327 7.2560 1.2994 0.5163
hfenergy: -1093.1823797 hartree
pointgroup: C01 [X(C8H6Cl1F1O3)]
dipole: 1.1481744 1.3035378 -0.1473347 debye
dipolederiv: -0.0989512 0.1011159 0.0586676 0.121312 -0.5592437 -0.2595802 0.0717605 -0.2571475 -0.1649023 -1.0777596 0.1439468 0.2709247 0.1343374 -0.2307356 -0.068279 0.2841717 -0.0705908 -0.2393528 -1.6183061 -0.191815 0.1147722 -0.065478 -0.2327154 -0.0130767 0.3015498 0.0553195 -0.3080744 -1.0772772 -0.4539272 0.0427089 -0.520656 -0.78231 -0.0094874 -0.1207864 -0.0823702 -0.262968 -0.6071427 -0.1993472 -0.0514489 -0.2402918 -0.4917418 0.123064 0.0896517 0.2969505 -0.7450767 1.3435575 0.0773598 -0.1584832 -0.2790598 -0.258083 -0.1284281 -0.3605059 -0.1816006 0.1200205 -0.0327114 -0.0810562 -0.0709552 -0.2601904 0.8721435 0.4837825 -0.1258652 0.4346211 0.1307483 -0.1215428 -0.1556434 -0.065615 0.2487856 0.0115677 0.0495957 0.1161194 0.1431136 -0.1208106 -0.1536945 0.0058892 0.0193069 0.1548351 -0.2048261 -0.0897878 0.076521 -0.0470319 -0.1429556 0.7919953 0.14475 0.0293365 0.4311435 0.3752881 -0.0051107 -0.050614 -0.0111172 -0.0224829 -0.1405503 0.1578363 0.0599106 -0.1084117 -0.0201283 0.0758345 -0.0642323 0.0205717 -0.1294454 1.121496 -0.1622175 -0.3139943 -0.1278852 0.2082207 0.0940972 -0.3091621 0.0979261 0.1862782 1.1675876 0.6988957 0.0802168 0.7209395 0.810229 -0.1594311 0.1343384 -0.2527551 0.9749547 -0.0002104 -0.0920575 0.000226 -0.1108671 0.0226299 -0.0454429 -0.0066365 -0.0429083 0.1360433 -0.0449709 -0.0098963 0.0403502 0.0133935 0.1050052 -0.0463524 0.0380511 -0.0226103 0.0809309 0.0312255 0.055773 -0.0632684 -0.0798618 -0.0851619 0.0590093 -0.057668 -0.0012365 0.0835986 0.0687037 -0.0453247 0.0070363 -0.0523701 0.0763579 -0.0347408 0.0050969 -0.0357228 0.1700794 0.0853828 0.0212195 0.0303219 0.0339282 0.0190419 -0.0781502 0.0414092 -0.0773347 0.1410726 0.3631691 -0.0155012 -0.0300135 -0.0136029 0.3644619 0.0524841 -0.0631992 0.0339234 0.1123422 unknown
polarizability: 129.5373474|8.8766756|107.5472164|-11.6338003|22.3266274|71.9004165 unknown
InChI: InChI=1S/C8H6ClFO3/c9-6-3-5(10)1-2-7(6)13-4-8(11)12/h1-3,11H,4H2
charge 0 multiplicity 1
19 atoms
Cl -0.693744 -2.734636 -1.359204
F  -4.11161 0.482476 0.855378
O  1.147305 -0.486761 -0.849307
O  3.818569 1.588881 0.599382
O  2.421418 0.061946 1.677129
C  -0.138019 -0.171643 -0.383846
C  -1.13397 -1.166137 -0.572262
C  -0.503634 1.050352 0.231071
C  -2.461739 -0.960164 -0.16177
C  2.18754 0.518487 -0.764597
C  -1.833269 1.279586 0.647756
C  -2.78272 0.268645 0.441823
C  2.771479 0.657699 0.644466
H  0.241908 1.829251 0.411594
H  2.987125 0.166278 -1.43687
H  1.851676 1.510493 -1.126137
H  -3.225492 -1.727957 -0.306351
H  -2.12286 2.217286 1.12907
H  4.234736 1.676217 1.499375
