program: Gaussian 09
title: 000223037
version: EM64L-G09RevD.01
frameworkgroup: C1[X(C16H17N3O2)]
method: RPBEPBE
basis: SDD
operation: Freq
keyword: #p
keyword: freq=noraman
keyword: PBEPBE/SDD
title: #p freq=noraman PBEPBE/SDD
converged: YES YES NO NO
title: Mulliken charges:
elementType: O O N N N C C C C C C C C C C C C C C C C H H H H H H H H H H H H H H H H H
charge: -0.299014 -0.293917 0.003407 -0.007621 -0.007677 0.246593 -0.455931 -0.454665 0.431527 -0.435326 -0.436415 -0.542915 -0.378972 -0.293090 0.187150 -0.352197 0.181366 -0.159635 -0.160730 -0.530424 -0.530303 0.247262 0.239662 0.247474 0.238634 0.271740 0.276487 0.276974 0.272132 0.257032 0.260021 0.258504 0.256875 0.227266 0.237842 0.255677 0.227910 0.237297
chargesum: 0.00000
title: Mulliken charges with hydrogens summed into heavy atoms:
elementType: O O N N N C C C C C C C C C C C C C C C C
charge: -0.299014 -0.293917 0.003407 -0.007621 -0.007677 0.246593 0.030993 0.031442 0.431527 0.112901 0.112690 -0.285882 -0.118951 -0.293090 0.187150 -0.093693 0.181366 -0.159635 -0.160730 0.191560 0.190581
polarizability: 2.20270017e+02 -8.18539589e-01 1.74114907e+02 5.06712163e+00 5.16700049e+00 1.76091160e+02
1716.lowfreq: -6.9089 -4.6274 -0.0008 -0.0007 -0.0007 1.0620 18.4356 29.2097 38.2317
frequency: 17.8821 29.1584 38.2107 58.9785 59.8350 74.4412 90.6503 101.0431 111.8929 115.2597 118.1375 147.7194 152.9405 158.4499 166.5696 189.0335 194.5480 221.4708 238.7108 278.6120 292.3643 338.7635 343.7090 363.0892 372.8279 377.0742 397.4356 441.6927 447.9876 489.5008 498.4000 508.4086 571.9847 611.8167 615.3436 664.7544 691.5971 711.6660 748.9144 752.5241 767.1638 817.0586 844.7820 886.5238 896.1199 926.9851 934.8290 942.7943 962.9202 970.7920 993.8851 1012.8785 1049.7566 1061.5610 1072.2802 1087.2236 1111.4061 1113.1968 1115.5259 1141.1974 1154.5731 1155.8767 1175.7833 1191.7755 1228.9884 1248.8744 1260.7001 1265.4966 1281.5638 1285.2499 1318.2486 1336.3781 1355.8781 1358.9959 1396.8245 1425.3718 1443.0579 1448.9789 1451.0268 1458.7548 1460.7407 1462.6147 1473.2773 1475.4254 1483.5764 1487.2001 1567.4503 1609.1661 2183.6020 2201.3647 2201.7315 2977.6425 2979.2063 2995.0239 2995.3224 3010.4164 3015.0900 3048.6766 3049.9379 3075.6269 3077.0655 3077.1434 3082.6005 3129.2889 3129.5535 3141.2428 3144.5941 3168.1010
redmass: 4.7006 6.4653 9.1002 5.2957 5.6749 3.1218 2.5230 4.7415 3.7096 4.1191 4.4033 3.6641 1.3221 1.1409 3.4206 3.1012 5.4039 3.0113 4.1186 5.0979 5.1972 5.6825 4.3292 4.7663 3.9219 4.0169 5.7043 4.9143 4.6047 3.6049 7.5679 6.5338 5.7595 5.5125 5.1048 4.6411 4.9340 5.7790 2.5328 1.5839 1.3691 3.3958 1.4668 2.4584 1.7029 5.1548 5.1861 7.9483 1.4077 4.6728 4.1737 1.7187 2.7215 3.8618 4.1849 3.0605 1.4633 1.6556 1.2917 1.6349 1.4016 1.3484 1.1058 1.8583 1.8578 2.4915 1.4771 1.2593 1.1528 1.3305 1.2882 1.4129 1.6132 3.8806 2.7685 1.1776 1.3098 1.0758 1.0904 1.0536 1.0706 1.0880 1.0892 1.0617 2.6804 1.0521 7.1715 6.5510 12.6462 12.4369 12.4367 1.0308 1.0310 1.0589 1.0589 1.0594 1.0593 1.1004 1.1001 1.1043 1.1046 1.1048 1.1041 1.1029 1.1030 1.0909 1.0888 1.0960
irintensity: 0.0177 0.2639 7.9016 0.5778 2.0542 3.4415 5.9352 6.2711 7.7632 8.0416 2.7280 5.9322 0.1329 0.2415 7.0846 0.1425 0.0699 5.5025 8.5339 3.9664 1.1951 0.3761 1.6737 0.2077 0.4453 2.0233 1.3532 2.4363 3.6710 7.4208 3.5997 1.3652 5.4925 8.4792 2.6485 1.7086 19.6988 8.2852 9.5617 11.0495 1.0346 14.3694 30.5058 3.9417 21.7103 0.0773 0.7311 66.8488 3.2290 64.8085 3.9274 0.0179 1.1007 1.2037 0.0895 42.8935 25.7397 6.9767 7.2230 1.4395 0.0854 5.2264 0.2035 18.9014 58.6139 131.5221 12.7421 16.4404 1.0071 0.8442 14.6535 9.5893 15.0176 16.6082 20.9397 1.2612 13.9606 0.5349 10.2117 18.2332 7.8242 0.1552 37.1105 8.1865 153.0626 24.7729 6.8686 6.6712 4.6906 19.7593 10.2580 76.8775 52.1125 2.0051 0.7478 5.6614 23.8798 0.8416 0.1635 30.6968 18.6389 1.3456 34.3214 18.5591 19.4879 3.1510 2.5536 2.7777
temp: 298.150 k
press: 1.00000 atm
elementType: 8 8 7 7 7 6 6 6 6 6 6 6 6 6 6 6 6 6 6 6 6 1 1 1 1 1 1 1 1 1 1 1 1 1 1 1 1 1
symmnumber: 1
zpe: 774326.9 jmol-1
zpe.correction: 0.294926 hartree
zpe.thermalcorrener: 0.317423 hartree
zpe.thermalcorrenthalpy: 0.318367 hartree
zpe.thermalcorrgfe: 0.241087 hartree
zpe.sumelectzpe: -932.986265 hartree
zpe.sumelectthermal: -932.963768 hartree
zpe.sumelectthermalent: -932.962824 hartree
zpe.sumelectthermalfe: -933.040103 hartree
dipole: -5.5288 -0.1299 0.7350
dipole: 5.5790
quadrupole: -122.5974 -166.1759 -133.2393
quadrupole: -0.4897 2.6990 6.3498
quadrupole: 18.0735 -25.5051 7.4316 -0.4897 2.6990 6.3498
hfenergy: -933.2811907 hartree
pointgroup: C01 [X(C16H17N3O2)]
dipole: 2.181312 -0.1083372 -0.2187724 debye
polarizability: 219.9249804|-0.0892695|173.968059|6.3276028|-5.2686745|176.5830448 unknown
InChI: InChI=1S/C16H17N3O2/c1-20-14-6-5-13(11-15(14)21-2)16(12-19,7-3-9-17)8-4-10-18/h5-6,11H,3-4,7-8H2,1-2H3
charge 0 multiplicity 1
38 atoms
O  2.876241 -0.227621 1.74609
O  4.08643 -0.191207 -0.935643
N  -2.981066 0.311051 -2.54215
N  -2.211274 4.778908 1.566309
N  -2.750836 -4.627491 1.0991
C  -1.671657 0.10603 -0.216831
C  -2.053168 1.359958 0.651587
C  -2.212734 -1.173673 0.520574
C  -0.140173 0.018573 -0.42984
C  -1.620214 2.702142 0.004265
C  -1.950774 -2.484318 -0.267856
C  0.704971 -0.071386 0.705128
C  0.449363 0.005728 -1.717977
C  -2.379307 0.217482 -1.516203
C  2.10498 -0.158503 0.567608
C  1.852595 -0.058462 -1.862929
C  2.693599 -0.117755 -0.732931
C  -1.945595 3.853195 0.861882
C  -2.393063 -3.671235 0.481515
C  3.706549 -1.450798 1.887764
C  4.86742 0.933484 -0.361146
H  -3.145521 1.364832 0.819441
H  -1.568766 1.256336 1.639041
H  -3.297536 -1.05873 0.698279
H  -1.721679 -1.23396 1.508232
H  -0.530646 2.696986 -0.186432
H  -2.121646 2.835741 -0.973497
H  -2.480163 -2.45907 -1.239576
H  -0.871406 -2.584558 -0.48855
H  0.307972 -0.090777 1.72622
H  -0.18004 0.061092 -2.612462
H  2.319349 -0.048276 -2.852754
H  4.384043 -1.573892 1.024482
H  3.053992 -2.33856 1.983612
H  4.280005 -1.304701 2.8150
H  4.678386 1.037499 0.72206
H  4.607924 1.874488 -0.880966
H  5.921141 0.679447 -0.548748
