program: Gaussian 09
title: 000223035
version: EM64L-G09RevD.01
frameworkgroup: C1[X(C16H13NO3)]
method: RPBEPBE
basis: SDD
operation: Freq
keyword: #p
keyword: freq=noraman
keyword: PBEPBE/SDD
title: #p freq=noraman PBEPBE/SDD
converged: YES YES NO NO
title: Mulliken charges:
elementType: O O O N C C C C C C C C C C C C C C C C H H H H H H H H H H H H H
charge: -0.243777 -0.407625 -0.248696 -0.492525 0.452926 0.264367 0.379096 -0.421746 0.178016 -0.400328 -0.382533 -0.345904 -0.371718 -0.245733 -0.243571 -0.223730 -0.231466 -0.235615 -0.225680 0.116050 0.206986 0.309409 0.221508 0.311640 0.273771 0.232683 0.228697 0.230320 0.234656 0.231663 0.231251 0.234363 0.383249
chargesum: 0.00000
title: Mulliken charges with hydrogens summed into heavy atoms:
elementType: O O O N C C C C C C C C C C C C C C C C
charge: -0.243777 -0.024376 -0.248696 -0.183115 0.452926 0.264367 0.379096 -0.214760 0.178016 -0.178821 -0.070893 -0.072134 -0.139035 -0.017036 -0.013252 0.010926 0.000197 -0.004364 0.008682 0.116050
polarizability: 3.69034656e+02 -1.18352665e+01 1.77390137e+02 -1.48359125e+00 -1.73535758e+01 1.08407961e+02
1716.lowfreq: -1.0562 -0.0007 -0.0006 -0.0001 4.1526 7.0575 24.7387 33.5335 39.6811
frequency: 24.7260 33.4926 39.6780 53.8915 64.3229 110.1755 134.5481 142.0260 161.4218 183.4624 229.0585 245.1759 305.9346 322.0190 331.2060 403.1543 406.6126 409.1015 423.3738 489.8068 503.0569 532.6455 552.3048 561.9663 606.4188 614.2847 618.3318 645.3579 674.6645 692.7407 700.1558 705.5248 731.4010 745.7486 773.5967 791.6713 838.6418 856.5865 858.1694 891.5691 911.4203 937.9492 947.1278 984.6032 985.9740 988.3195 990.1243 1005.8132 1013.1070 1023.2937 1031.3464 1035.1609 1076.0069 1090.5019 1095.7301 1173.7535 1174.6157 1190.1497 1197.6966 1206.7040 1240.7105 1258.0274 1283.2868 1318.8474 1344.6180 1373.6721 1385.2660 1397.3543 1432.6702 1439.9820 1467.4874 1482.2775 1489.0140 1574.3887 1576.6685 1603.6532 1606.3888 1610.6560 1624.6788 1640.3571 3061.1157 3114.1520 3121.7482 3130.4470 3133.9739 3144.4599 3146.5206 3158.7220 3162.1709 3170.6053 3179.2588 3532.1195 3541.2148
redmass: 4.5194 5.0536 5.6184 4.9929 6.7427 5.0468 7.7157 5.5991 7.1248 5.3970 6.7004 5.6103 7.0765 4.4355 4.6206 2.8629 3.0054 4.8882 3.7853 4.3649 2.8946 4.2156 2.1067 1.3054 2.4129 6.1917 5.2991 6.4136 6.5719 5.0030 1.8164 1.5701 4.7529 6.4072 1.8610 2.3974 4.2512 1.2637 1.2741 5.0672 1.5405 1.4404 1.5298 1.5383 1.6962 3.2514 4.1922 1.3429 1.3410 2.6121 2.5421 2.6230 2.0769 1.7964 1.9188 1.0872 1.0580 1.1237 1.8522 1.2332 3.3640 2.3153 1.7015 1.3267 1.4261 4.2168 9.0161 2.7625 2.2163 2.2592 1.7822 2.1817 2.3183 6.1483 5.6610 6.7528 6.3509 5.9762 7.1001 8.0138 1.0865 1.0876 1.0871 1.0872 1.0873 1.0934 1.0920 1.0958 1.0992 1.1011 1.0964 1.0642 1.0770
irintensity: 0.5599 0.3109 0.3902 0.9863 0.4411 2.6020 4.4092 1.9838 1.1598 1.5529 8.3643 0.2080 7.4193 3.9097 0.5919 0.3962 0.1075 2.2768 5.6353 15.1590 8.7101 7.9058 71.8300 62.0184 83.6944 0.7828 12.3545 9.8024 11.7285 12.8420 47.9716 121.9756 26.2728 9.7736 32.2022 18.5238 8.6690 3.2630 1.9051 19.1260 8.2186 2.0804 15.4566 2.3656 1.3697 0.0113 0.1612 1.6860 1.9258 45.0476 52.7700 233.2445 18.6876 28.3446 8.9747 0.9718 1.1009 7.4793 29.6124 17.2691 26.4617 210.1119 11.9120 2.5794 25.5808 220.9384 3.3853 287.3125 7.6524 52.7297 143.2837 19.4795 77.1514 19.9301 53.5855 10.0325 67.9087 6.2370 29.9123 122.7066 26.3155 10.2114 10.2758 0.5264 1.6506 33.1128 20.4472 16.4163 29.0242 25.2304 27.9792 52.4302 8.2576
temp: 298.150 k
press: 1.00000 atm
elementType: 8 8 8 7 6 6 6 6 6 6 6 6 6 6 6 6 6 6 6 6 1 1 1 1 1 1 1 1 1 1 1 1 1
symmnumber: 1
zpe: 659225.7 jmol-1
zpe.correction: 0.251086 hartree
zpe.thermalcorrener: 0.268280 hartree
zpe.thermalcorrenthalpy: 0.269225 hartree
zpe.thermalcorrgfe: 0.203883 hartree
zpe.sumelectzpe: -896.535808 hartree
zpe.sumelectthermal: -896.518613 hartree
zpe.sumelectthermalent: -896.517669 hartree
zpe.sumelectthermalfe: -896.583010 hartree
dipole: -1.2789 -4.3975 1.9198
dipole: 4.9658
quadrupole: -90.7376 -109.5173 -118.1127
quadrupole: 2.2399 0.5360 2.4838
quadrupole: 15.3849 -3.3948 -11.9902 2.2399 0.5360 2.4838
hfenergy: -896.7868934 hartree
pointgroup: C01 [X(C16H13N1O3)]
dipole: 0.5018206 1.8846933 -0.1140884 debye
polarizability: 368.5746393|-8.9195337|176.8972484|13.3175065|-18.431466|109.3608661 unknown
InChI: InChI=1S/C16H13NO3/c18-15(13-9-5-2-6-10-13)17-14(16(19)20)11-12-7-3-1-4-8-12/h1-11,17,19H
charge 0 multiplicity 1
33 atoms
O  1.667971 -1.93547 0.187974
O  0.025052 -1.132892 2.446065
O  -1.636608 -2.252319 1.278004
N  0.74695 0.202571 0.166958
C  -3.062695 0.418292 -0.346297
C  3.190865 -0.039809 0.055854
C  -0.604216 -0.224573 0.329763
C  -1.592427 0.45187 -0.353551
C  1.835264 -0.678996 0.14801
C  -3.717869 1.561959 -0.902819
C  -3.878257 -0.654019 0.127985
C  4.247567 -0.813425 -0.489794
C  3.457061 1.276704 0.517336
C  -5.121756 1.652679 -0.955127
C  -5.283869 -0.558217 0.070796
C  5.544218 -0.27107 -0.597556
C  4.757912 1.816514 0.412736
C  -5.91527 0.590127 -0.462308
C  5.80199 1.047476 -0.151466
C  -0.807016 -1.315264 1.334105
H  -1.197209 1.24324 -1.012412
H  0.913258 1.184102 -0.062174
H  -3.109975 2.391093 -1.287538
H  -3.406855 -1.562996 0.507601
H  4.028218 -1.836033 -0.813927
H  2.671885 1.866309 1.006093
H  -5.596063 2.543683 -1.380936
H  -5.891453 -1.394762 0.433736
H  6.353482 -0.872769 -1.025054
H  4.959749 2.827798 0.782235
H  -7.008422 0.650975 -0.505373
H  6.810468 1.467878 -0.232439
H  -0.073749 -1.920353 3.045514
