program: Gaussian 09
title: 000217742
version: EM64L-G09RevD.01
frameworkgroup: C1[X(C20H12N2O4S2)]
method: RPBEPBE
basis: SDD
operation: Freq
keyword: #p
keyword: freq=noraman
keyword: PBEPBE/SDD
title: #p freq=noraman PBEPBE/SDD
converged: YES YES NO NO
title: Mulliken charges:
elementType: S S O O O O N N C C C C C C C C C C C C C C C C C C C C H H H H H H H H H H H H
charge: 0.062037 0.062151 -0.173918 -0.173687 -0.173674 -0.173935 -0.346048 -0.346092 0.508912 0.508896 -0.343466 -0.353110 -0.353201 -0.343530 0.159163 0.159337 0.159488 0.159062 -0.272420 -0.272648 -0.189837 -0.177324 -0.176780 -0.189330 -0.250954 -0.250692 -0.250807 -0.250824 0.274790 0.276570 0.276569 0.274777 0.260827 0.269183 0.269128 0.260794 0.280187 0.280105 0.280106 0.280195
chargesum: 0.00000
title: Mulliken charges with hydrogens summed into heavy atoms:
elementType: S S O O O O N N C C C C C C C C C C C C C C C C C C C C
charge: 0.062037 0.062151 -0.173918 -0.173687 -0.173674 -0.173935 -0.346048 -0.346092 0.508912 0.508896 -0.068676 -0.076540 -0.076632 -0.068752 0.159163 0.159337 0.159488 0.159062 -0.272420 -0.272648 0.070990 0.091859 0.092348 0.071464 0.029234 0.029414 0.029299 0.029371
polarizability: 4.53862738e+02 1.20911647e-02 3.21723043e+02 -1.03273613e+00 -1.93764897e-01 1.40142515e+02
1716.lowfreq: -2.7122 0.0016 0.0016 0.0017 1.6843 3.8110 9.3268 10.7453 14.9926
frequency: 9.3251 10.7125 14.9841 35.2662 38.8021 52.6837 62.5454 71.6576 81.6746 97.1629 115.3930 143.1729 153.9770 181.2588 207.6742 245.9638 247.7832 253.8145 267.0757 280.6544 280.7469 319.3302 351.2279 368.9360 386.1660 393.2175 401.2225 403.9371 405.9876 408.5172 500.9065 501.7985 518.7144 520.5167 568.6442 569.1282 617.8599 618.0681 621.2598 621.4003 630.0954 630.4501 683.8469 684.1716 720.3334 720.4939 725.4092 726.2315 736.8307 736.8602 822.4948 822.6812 830.4342 834.8541 843.1452 845.7981 939.0830 939.2779 943.3386 943.3558 959.7375 961.4525 973.3318 976.4834 997.1073 997.2664 1001.9353 1001.9730 1055.8649 1056.3941 1071.3819 1076.4354 1088.4680 1088.6967 1123.5644 1124.9090 1190.6418 1191.4710 1200.5077 1202.0502 1287.7373 1287.7564 1296.9678 1298.4563 1340.4112 1344.4934 1365.1298 1365.5272 1406.6987 1406.8748 1480.2038 1480.9740 1566.0678 1566.1478 1590.9898 1591.1043 1595.7095 1596.8236 1624.2372 1625.5825 1676.5869 1677.3245 3156.9886 3158.0728 3159.7045 3159.8541 3189.2368 3189.3666 3192.4347 3192.5744 3207.8909 3207.9146 3235.9772 3236.0019
redmass: 8.9570 9.1107 10.1333 8.4279 7.3294 4.3060 4.6288 6.7380 6.4362 7.4085 10.9954 11.0869 11.1803 8.7394 9.7816 13.0103 12.3659 9.0103 9.5709 4.2431 4.2416 8.0716 6.1832 7.5869 6.6990 10.2413 8.9599 6.5819 2.9477 3.2887 7.6968 7.3193 3.2083 3.2321 3.8852 3.8815 9.1609 9.0856 3.9049 3.8306 3.2923 3.3455 8.0443 8.0544 4.1207 4.1831 6.2975 6.4027 7.1063 7.1024 1.8258 1.8265 1.2481 1.2968 1.7007 1.6018 6.9536 6.9288 1.3127 1.3127 1.3733 1.3660 1.3818 1.3691 4.6311 4.5833 4.0932 3.9712 1.3736 1.3161 2.3220 2.5405 4.1864 4.1715 1.4292 1.4335 1.4823 1.6290 2.0075 1.7800 1.7185 1.7186 1.3115 1.3073 6.1987 6.0170 6.1173 5.7274 3.2281 3.3243 2.4981 2.4803 7.4506 7.4631 6.8777 6.8517 6.0225 6.0391 11.4081 11.4376 11.5357 11.5325 1.0906 1.0904 1.0905 1.0904 1.0949 1.0949 1.0961 1.0962 1.0896 1.0896 1.1110 1.1110
irintensity: 0.1728 0.1130 0.0421 0.9107 0.0169 0.5943 0.8339 0.2553 8.4757 0.9212 2.0934 10.1383 0.6651 0.1513 0.3456 3.3093 17.2844 3.0488 3.4073 0.0596 0.1191 7.4612 2.9932 1.1723 4.8963 2.7763 0.7394 0.4909 2.3077 2.6155 0.2259 7.7823 24.5690 2.4124 12.8045 4.1757 18.9929 27.1847 5.7247 0.0308 10.4087 1.4046 48.9951 35.8050 10.4522 0.3336 1.3158 2.8223 1.3403 4.3783 48.5933 4.8311 3.2896 0.0019 186.1282 5.0048 27.3577 11.3832 0.1261 0.1477 4.8668 2.2624 0.1059 0.0113 20.5770 9.8520 0.5266 3.2810 21.9653 27.4702 16.1167 26.9373 57.0467 32.5876 30.4081 23.4511 2.4393 15.4394 62.1771 16.8104 1.6099 1.5676 1.0760 0.0337 697.5264 413.2010 0.3181 1.3992 13.8535 21.6190 116.6690 167.8355 10.1360 1.1087 54.0935 39.3083 45.2161 64.7596 469.5716 301.9743 11.2142 0.2511 5.7162 1.7182 0.1129 1.6407 1.1526 0.2352 3.2184 0.3306 0.0827 0.0824 0.5806 0.5450
temp: 298.150 k
press: 1.00000 atm
elementType: 16 16 8 8 8 8 7 7 6 6 6 6 6 6 6 6 6 6 6 6 6 6 6 6 6 6 6 6 1 1 1 1 1 1 1 1 1 1 1 1
symmnumber: 1
zpe: 716598.1 jmol-1
zpe.correction: 0.272938 hartree
zpe.thermalcorrener: 0.297387 hartree
zpe.thermalcorrenthalpy: 0.298331 hartree
zpe.thermalcorrgfe: 0.213051 hartree
zpe.sumelectzpe: -1973.926441 hartree
zpe.sumelectthermal: -1973.901991 hartree
zpe.sumelectthermalent: -1973.901047 hartree
zpe.sumelectthermalfe: -1973.986328 hartree
dipole: -0.0012 -5.4408 -0.0038
dipole: 5.4408
quadrupole: -137.9848 -169.7788 -176.4679
quadrupole: 0.0372 14.1483 0.0337
quadrupole: 23.4257 -8.3683 -15.0574 0.0372 14.1483 0.0337
hfenergy: -1974.1993786 hartree
pointgroup: C01 [X(C20H12N2O4S2)]
dipole: 0.0177519 2.1404721 0.014101 debye
polarizability: 453.8508817|-1.1301977|321.7286955|-1.3166675|0.8866642|140.1487183 unknown
InChI: InChI=1S/C20H12N2O4S2/c23-17-9-10-18(24)21(17)13-1-5-15(6-2-13)27-28-16-7-3-14(4-8-16)22-19(25)11-12-20(22)26/h1-12H
charge 0 multiplicity 1
40 atoms
S  0.603109 -3.5816 0.956457
S  -0.663842 -3.557682 -1.012508
O  6.770248 -0.457146 0.25502
O  3.306449 2.6599 -0.522555
O  -3.260561 2.713247 0.533013
O  -6.776706 -0.342747 -0.251967
N  4.734097 0.782622 -0.057736
N  -4.719836 0.862611 0.059523
C  3.755969 -0.244364 0.172538
C  -3.759179 -0.177744 -0.18381
C  4.035443 -1.584218 -0.203032
C  -2.515591 0.135358 -0.790499
C  2.514296 0.083505 0.775401
C  -4.057984 -1.516082 0.182263
C  6.160517 0.606156 -0.004064
C  4.443678 2.153306 -0.382605
C  -4.406285 2.226098 0.393271
C  -6.149089 0.709182 0.010786
C  1.828606 -2.265893 0.61881
C  -1.866606 -2.225886 -0.657048
C  3.073435 -2.587096 0.023713
C  -1.574557 -0.887658 -1.020933
C  1.556014 -0.926268 0.992592
C  -3.113394 -2.532228 -0.058188
C  6.766564 1.948743 -0.307876
C  5.770607 2.846124 -0.528161
C  -5.721454 2.937509 0.554744
C  -6.73246 2.057676 0.332235
H  4.995747 -1.841759 -0.654284
H  -2.279903 1.164415 -1.069498
H  2.29352 1.113837 1.061792
H  -5.019934 -1.76209 0.636452
H  3.281182 -3.621581 -0.266063
H  -0.615433 -0.653051 -1.492931
H  0.598282 -0.680259 1.461662
H  -3.336314 -3.565756 0.223669
H  7.846868 2.091712 -0.325901
H  5.832522 3.905488 -0.776613
H  -5.765525 3.995105 0.814308
H  -7.810299 2.216915 0.359121
