program: Gaussian 09
title: 000223020
version: EM64L-G09RevD.01
frameworkgroup: C1[X(C14H17NO5)]
method: RPBEPBE
basis: SDD
operation: Freq
keyword: #p
keyword: freq=noraman
keyword: PBEPBE/SDD
title: #p freq=noraman PBEPBE/SDD
converged: YES YES NO NO
title: Mulliken charges:
elementType: O O O O O N C C C C C C C C C C C C C C H H H H H H H H H H H H H H H H H
charge: -0.273190 -0.280733 -0.237678 -0.284778 -0.221066 -0.412877 -0.358232 0.384957 -0.534919 0.343309 0.099259 -0.549189 0.252690 -0.562552 0.221760 0.221621 -0.265151 -0.662468 -0.535390 -0.519651 0.270855 0.255130 0.255274 0.323515 0.258526 0.258304 0.220612 0.237610 0.218650 0.253590 0.225108 0.244588 0.226935 0.222262 0.211968 0.230950 0.260399
chargesum: 0.00000
title: Mulliken charges with hydrogens summed into heavy atoms:
elementType: O O O O O N C C C C C C C C C C C C C C
charge: -0.273190 -0.280733 -0.237678 -0.284778 -0.221066 -0.089362 -0.087376 0.384957 -0.024515 0.343309 0.099259 -0.290662 0.252690 -0.304248 0.221760 0.221621 0.193071 0.034881 0.158394 0.183667
polarizability: 2.31028176e+02 2.49639696e+01 1.93949738e+02 1.31236574e+01 -1.53121224e+01 1.24048298e+02
1716.lowfreq: -9.6531 -1.2629 -0.0009 -0.0007 -0.0005 5.3316 26.7257 31.9791 36.0459
frequency: 26.6785 31.6495 35.8875 44.2262 65.3799 77.2238 94.5340 105.0328 119.6243 149.6621 164.6270 183.7588 200.4699 207.4616 243.4831 250.6228 274.7062 287.1524 307.0447 320.9938 336.4546 385.7209 407.9052 422.4969 450.5339 459.8111 479.6048 496.0903 557.6118 596.7425 620.1414 648.1222 675.3774 694.0413 708.2661 727.1846 731.4814 762.2800 776.8540 814.0989 843.1545 855.2846 858.3006 873.2110 897.7247 936.5010 984.4943 991.6233 1006.2093 1040.9254 1094.2672 1105.7145 1111.8716 1113.7670 1119.4262 1149.3167 1155.4970 1159.0740 1172.3991 1186.8300 1212.0580 1234.2390 1256.6044 1278.4179 1293.9015 1302.8156 1326.0689 1339.9217 1354.2111 1359.7585 1391.9793 1392.3227 1423.9403 1439.8466 1440.9210 1454.3843 1455.7784 1463.2033 1465.9586 1466.7339 1474.6612 1480.8184 1484.9949 1509.7042 1592.6717 1623.9908 1639.2254 1646.4726 2960.2477 2978.5053 2993.9802 2999.5087 3029.8564 3042.8938 3048.5627 3088.1322 3088.5321 3094.0772 3096.2424 3119.8530 3124.4540 3129.8266 3151.9219 3155.3591 3527.5364
redmass: 4.0951 2.6064 2.2643 3.2715 4.9959 4.0808 3.6306 4.6780 3.0866 2.7555 3.0511 2.3766 1.7049 2.9440 1.8084 2.7495 2.2575 3.1354 4.2664 4.3069 4.2490 6.1080 5.1529 4.5263 4.9359 4.0659 3.9818 2.6585 4.1869 4.9778 4.3792 5.9348 4.0851 1.6973 5.8056 3.9986 4.1537 3.2006 3.3314 1.5002 4.4865 1.7176 2.9150 1.5999 3.8401 6.3427 3.5663 3.3704 2.5988 2.8571 2.3601 3.4622 1.2454 1.2589 2.9775 1.4726 1.6596 1.4589 1.7877 1.3182 2.0832 1.7233 1.9065 1.1177 1.8392 2.4188 1.6020 3.5172 1.4588 2.2262 4.6191 1.2359 1.2527 1.2429 1.0877 1.0688 1.0944 1.0432 1.1624 2.0639 1.0968 1.0556 1.0511 3.2094 8.2500 7.1593 7.1515 7.2329 1.0328 1.0346 1.0362 1.0665 1.0591 1.0845 1.1040 1.0971 1.0977 1.1034 1.0952 1.1060 1.0996 1.1049 1.0914 1.0908 1.0764
irintensity: 0.6368 1.7776 2.2991 0.0575 1.2367 1.0841 1.1886 10.9752 0.6653 1.0606 2.3883 4.6804 1.0047 0.0576 4.8836 2.4275 1.4811 5.5025 10.8268 6.9393 5.3570 11.2963 2.5451 4.3814 0.7231 11.2208 0.8029 2.9654 35.9092 11.3780 12.1372 7.7693 16.2441 66.3241 2.3947 14.2411 7.3523 11.3234 8.0238 3.0316 4.6165 9.2511 3.3500 50.4371 1.3613 35.1267 19.4950 53.7496 34.5358 74.9657 86.8591 123.5102 9.6176 0.4905 207.7054 2.3545 11.0109 20.7025 74.2366 31.0739 112.5771 29.5559 200.9718 3.0467 53.6609 115.2718 10.4271 54.4678 3.9783 30.5933 47.7092 30.2110 2.9410 3.0525 8.6640 16.9961 8.5914 14.5506 12.6810 20.4828 94.7385 33.8850 12.8747 264.9781 17.6881 47.3300 100.9255 493.8378 60.6662 86.9800 21.2451 11.0968 24.0020 11.7959 44.4928 39.1494 31.2079 1.6422 7.0492 29.8149 23.0415 16.3837 6.2714 2.0409 26.8919
temp: 298.150 k
press: 1.00000 atm
elementType: 8 8 8 8 8 7 6 6 6 6 6 6 6 6 6 6 6 6 6 6 1 1 1 1 1 1 1 1 1 1 1 1 1 1 1 1 1
symmnumber: 1
zpe: 765799.8 jmol-1
zpe.correction: 0.291678 hartree
zpe.thermalcorrener: 0.312001 hartree
zpe.thermalcorrenthalpy: 0.312945 hartree
zpe.thermalcorrgfe: 0.240832 hartree
zpe.sumelectzpe: -973.058375 hartree
zpe.sumelectthermal: -973.038052 hartree
zpe.sumelectthermalent: -973.037108 hartree
zpe.sumelectthermalfe: -973.109221 hartree
dipole: -2.3843 -6.7655 0.9586
dipole: 7.2371
quadrupole: -122.0693 -116.0275 -110.5261
quadrupole: -11.0815 7.1493 -1.0974
quadrupole: -5.8617 0.1802 5.6815 -11.0815 7.1493 -1.0974
hfenergy: -973.3500529 hartree
pointgroup: C01 [X(C14H17N1O5)]
dipole: 0.8291677 2.7171633 0.1911304 debye
polarizability: 225.034479|26.9676949|197.5300758|-24.1046859|9.2330496|126.4616564 unknown
InChI: InChI=1S/C14H17NO5/c1-4-20-14(17)9-6-13(16)15-10-7-12(19-3)11(18-2)5-8(9)10/h5,7,9,15H,4,6H2,1-3H3
charge 0 multiplicity 1
37 atoms
O  -2.302179 1.713197 0.206018
O  3.164023 1.671328 0.297253
O  -2.368119 -3.840171 0.473459
O  3.902229 -0.763118 -1.018165
O  -2.931812 -0.30343 -0.793969
N  -0.447733 -2.67668 -0.10609
C  -1.416182 -0.299909 1.178699
C  0.015555 -0.383995 0.642957
C  -1.934065 -1.694775 1.600943
C  0.436732 -1.571353 -0.007181
C  -1.639605 -2.816892 0.603633
C  0.90879 0.704675 0.73531
C  -2.306551 0.319694 0.091903
C  1.730375 -1.639368 -0.573449
C  2.210854 0.639918 0.191487
C  2.61957 -0.549581 -0.492162
C  -3.085432 2.468252 -0.825332
C  -4.551082 2.598345 -0.402826
C  2.778058 2.865414 1.052129
C  4.488998 0.279741 -1.886712
H  -1.443308 0.386204 2.042821
H  -3.022278 -1.693211 1.773447
H  -1.445981 -1.978583 2.554543
H  -0.207045 -3.450861 -0.73083
H  0.563764 1.614428 1.236267
H  2.083739 -2.541635 -1.083729
H  -2.577709 3.444994 -0.871658
H  -2.990536 1.940872 -1.790643
H  -5.09366 3.229794 -1.130715
H  -5.039664 1.610177 -0.375361
H  -4.635304 3.069222 0.591877
H  3.665208 3.51544 1.034936
H  2.521679 2.610593 2.098711
H  1.924148 3.386128 0.576457
H  3.833006 0.467239 -2.758582
H  5.446322 -0.145576 -2.224134
H  4.650594 1.215282 -1.328715
