program: Gaussian 09
title: 000018886
version: EM64L-G09RevD.01
frameworkgroup: C1[X(C13H15N3O3)]
method: RPBEPBE
basis: SDD
operation: Freq
keyword: #p
keyword: freq=noraman
keyword: PBEPBE/SDD
title: #p freq=noraman PBEPBE/SDD
converged: YES YES NO NO
title: Mulliken charges:
elementType: O O O N N N C C C C C C C C C C C C C H H H H H H H H H H H H H H H
charge: -0.244482 -0.219416 -0.220217 -0.105041 -0.405500 0.013605 -0.466751 -0.344256 -0.342375 0.373751 -0.322166 -0.320539 0.125918 0.255627 -0.406259 -0.569870 -0.305995 0.390721 -0.382482 0.204311 0.225399 0.200746 0.225100 0.212497 0.193993 0.187727 0.217890 0.216668 0.190600 0.291191 0.314730 0.290513 0.239476 0.284887
chargesum: 0.00000
title: Mulliken charges with hydrogens summed into heavy atoms:
elementType: O O O N N N C C C C C C C C C C C C C
charge: -0.244482 -0.219416 -0.220217 -0.105041 -0.090770 0.013605 -0.037041 0.081589 0.064115 0.373751 0.083451 0.086729 0.125918 0.255627 -0.115068 -0.279357 -0.066519 0.390721 -0.097595
polarizability: 2.53014234e+02 1.87123909e+01 1.81865596e+02 -1.99750113e+01 6.33362198e+00 1.05820729e+02
1716.lowfreq: -8.4832 -4.2866 -0.0011 -0.0003 0.0002 9.1830 15.0583 43.9082 50.4379
frequency: 14.2610 43.8830 50.3594 67.3258 109.6668 115.5397 163.2349 185.9909 224.5952 243.6687 278.3672 301.8281 313.2430 337.0285 341.3456 395.0598 415.1546 424.4295 465.9126 478.0451 532.8834 552.7194 569.9170 582.5242 601.3209 620.2418 652.2003 704.0238 731.9949 752.8035 763.3331 775.9940 806.4840 813.5270 823.2058 837.1234 841.6478 894.3381 906.8352 930.1342 968.9217 981.7799 995.7269 1028.2255 1034.0807 1053.5517 1077.2362 1084.7939 1093.1704 1106.9718 1128.3232 1133.7824 1144.6008 1190.2719 1213.4220 1218.3486 1231.0718 1240.0945 1265.9925 1274.2632 1291.9536 1292.3186 1301.4624 1332.2921 1341.7908 1358.9635 1365.2077 1369.5720 1380.5242 1411.1903 1426.4091 1443.1387 1448.6629 1450.6874 1459.0281 1474.1802 1475.2316 1485.1403 1562.2255 1585.4057 1629.3526 2850.7808 2867.6722 2878.4381 2949.9222 2954.8201 2988.2506 3023.7608 3039.8617 3082.1884 3085.4832 3148.3629 3177.2118 3189.3078 3239.0693 3605.6597
redmass: 5.1891 3.8604 6.8089 6.3533 5.6554 5.5406 4.3352 3.7677 4.5771 2.2284 4.9736 3.1620 2.3560 4.5123 10.1574 1.8792 5.3903 2.8767 3.0690 5.3714 4.7010 1.8401 1.8797 4.6485 2.4672 3.2746 5.8792 5.5763 5.1728 5.7308 4.1893 4.2744 3.5945 3.9729 1.6601 1.4436 1.5899 2.7020 3.8613 1.4981 1.3251 2.1084 2.5752 2.1476 2.2478 1.9657 2.0729 2.9347 2.3690 2.3133 2.3180 1.4537 2.6790 1.0687 7.3187 1.2269 1.9825 1.7617 1.3386 1.4548 1.5100 1.7839 1.8703 1.3020 1.3536 1.7304 4.1511 1.2728 1.8141 3.3197 2.2452 1.0825 1.0835 1.0962 1.1090 1.3643 2.6250 5.9603 6.3843 6.6694 7.1513 1.0708 1.0705 1.0687 1.0671 1.0669 1.0863 1.0902 1.0896 1.0956 1.0972 1.0907 1.0922 1.0947 1.0988 1.0810
irintensity: 1.1894 1.1105 0.3749 0.4772 0.8872 1.8234 2.8017 5.1692 0.3676 1.9198 5.7608 2.4530 11.0293 5.5474 0.3526 0.4144 1.0888 11.5416 3.2129 4.8766 7.5666 55.3820 43.2541 4.4931 3.6349 1.2879 16.1180 30.1429 3.2221 7.8005 4.2286 5.6093 14.8632 10.8824 59.6798 11.8629 0.0913 16.1308 0.6375 21.3051 1.2840 3.4087 36.9498 9.2495 9.3748 21.9071 52.2570 38.1628 48.7681 3.4180 65.0429 13.2816 2.9736 1.2952 428.2534 12.6285 10.7760 12.6176 6.8637 21.5094 11.2201 5.0086 30.5633 1.7609 13.4902 23.3513 106.2088 0.9106 35.0645 68.0967 1.5364 2.3173 2.6298 16.0052 4.1728 10.9781 8.8100 6.1371 2.7793 8.6180 29.9999 39.3313 50.6894 116.2886 33.0345 104.4702 19.8287 48.4815 28.5335 40.1484 32.8429 9.6700 1.5577 4.6153 0.0275 79.7417
temp: 298.150 k
press: 1.00000 atm
elementType: 8 8 8 7 7 7 6 6 6 6 6 6 6 6 6 6 6 6 6 1 1 1 1 1 1 1 1 1 1 1 1 1 1 1
symmnumber: 1
zpe: 706349.1 jmol-1
zpe.correction: 0.269034 hartree
zpe.thermalcorrener: 0.285116 hartree
zpe.thermalcorrenthalpy: 0.286061 hartree
zpe.thermalcorrgfe: 0.223555 hartree
zpe.sumelectzpe: -892.813529 hartree
zpe.sumelectthermal: -892.797447 hartree
zpe.sumelectthermalent: -892.796503 hartree
zpe.sumelectthermalfe: -892.859008 hartree
dipole: 3.8001 6.4089 -1.1559
dipole: 7.5400
quadrupole: -147.4137 -102.0411 -109.8271
quadrupole: -16.0540 -6.3494 4.4826
quadrupole: -27.6531 17.7195 9.9335 -16.0540 -6.3494 4.4826
hfenergy: -893.0825631 hartree
pointgroup: C01 [X(C13H15N3O3)]
dipole: 1.5172174 2.5436704 -0.1663704 debye
polarizability: 253.9162217|19.8579876|179.4730041|-15.1959738|14.4502508|107.311333 unknown
InChI: InChI=1S/C13H15N3O3/c17-16(18)11-1-2-13-12(7-11)10(8-14-13)9-15-3-5-19-6-4-15/h1-2,7-8,14H,3-6,9H2
charge 0 multiplicity 1
34 atoms
O  5.309583 -0.910396 0.884393
O  -5.400045 -1.273636 0.195003
O  -3.692867 -2.664284 -0.396352
N  2.793078 -0.206353 -0.388159
N  -0.410331 2.683576 0.064743
N  -4.155742 -1.497689 -0.08031
C  1.426988 -0.43509 -0.922477
C  2.875655 -0.456905 1.076308
C  3.820943 -1.008039 -1.102702
C  0.457293 0.642803 -0.498644
C  4.284448 -0.11992 1.587285
C  5.218656 -0.660887 -0.563745
C  -0.971044 0.499862 -0.271753
C  -1.488246 1.80334 0.081551
C  0.759612 1.985098 -0.286518
C  -1.85787 -0.598711 -0.327338
C  -2.854303 2.024829 0.374221
C  -3.214509 -0.360079 -0.030389
C  -3.724134 0.92596 0.316509
H  1.024845 -1.436247 -0.621108
H  1.504623 -0.454436 -2.028309
H  2.644842 -1.525866 1.313646
H  2.129467 0.174782 1.591918
H  3.774152 -0.773777 -2.18352
H  3.647206 -2.106494 -0.978501
H  4.484285 0.964337 1.442857
H  4.394145 -0.377793 2.653404
H  5.991344 -1.299755 -1.022246
H  5.44309 0.407271 -0.774876
H  1.726361 2.4786 -0.35264
H  -0.456394 3.677037 0.28214
H  -1.534795 -1.609688 -0.589091
H  -3.230611 3.018233 0.639127
H  -4.790423 1.027516 0.531572
