program: Gaussian 09
title: 000222975
version: EM64L-G09RevD.01
frameworkgroup: C1[X(C14H15NO3)]
method: RPBEPBE
basis: SDD
operation: Freq
keyword: #p
keyword: freq=noraman
keyword: PBEPBE/SDD
title: #p freq=noraman PBEPBE/SDD
converged: YES YES NO NO
title: Mulliken charges:
elementType: O O O N C C C C C C C C C C C C C C H H H H H H H H H H H H H H H
charge: -0.275562 -0.216292 -0.224769 -0.028148 -0.321883 -0.420734 0.124339 -0.458441 0.254690 0.303745 -0.335419 -0.350790 -0.264607 -0.247689 -0.222627 -0.162059 -0.221051 -0.658089 0.263299 0.234553 0.242751 0.297872 0.293245 0.241030 0.275197 0.238072 0.225066 0.234009 0.237629 0.237187 0.220218 0.233596 0.251662
chargesum: 0.00000
title: Mulliken charges with hydrogens summed into heavy atoms:
elementType: O O O N C C C C C C C C C C C C C C
charge: -0.275562 -0.216292 -0.224769 -0.028148 -0.058584 0.056570 0.124339 0.132675 0.254690 0.303745 -0.094390 -0.075593 0.198531 -0.013680 0.015003 -0.162059 0.016136 0.047386
polarizability: 2.16592534e+02 -3.60302603e-01 1.49155602e+02 6.76532400e+00 -1.34840071e+01 1.27340219e+02
1716.lowfreq: -11.8545 -4.6079 0.0002 0.0005 0.0006 2.8062 13.0784 19.5985 31.0092
frequency: 12.6756 18.4941 30.9089 43.8283 62.2725 79.0378 92.7850 114.7791 143.8303 147.9404 174.4077 202.9844 208.1845 231.7557 272.0015 298.9015 327.8787 374.7217 389.0975 399.0493 418.5171 464.6755 472.3403 545.4127 580.1136 613.0698 633.9910 688.7229 693.0860 717.7697 753.0456 786.6624 806.0117 818.3834 830.6288 853.0778 858.8799 941.0143 951.1374 963.5475 984.0202 986.4635 991.2030 1008.7734 1009.7202 1028.2095 1047.4145 1082.7682 1090.2782 1097.9300 1137.8482 1156.2871 1175.3293 1180.0532 1193.6691 1214.8554 1246.8285 1268.5362 1275.6541 1303.5482 1309.1824 1322.3547 1351.3363 1367.8190 1387.6414 1393.7844 1434.7147 1457.9740 1461.9542 1464.2132 1470.6040 1478.0773 1483.5642 1563.4652 1592.6821 1608.5350 1639.7890 2194.6855 2996.0026 3002.6189 3019.7815 3031.3880 3032.7989 3057.9425 3084.3547 3091.7510 3097.1348 3123.0974 3132.4244 3142.5622 3153.6510 3162.5205 3172.5368
redmass: 6.0908 5.0347 3.7265 5.5521 4.3800 4.8090 4.1603 2.7521 4.2192 5.3069 3.9510 1.8746 4.9629 2.0657 3.2210 4.6510 4.4271 3.7078 5.1035 2.7785 4.1160 4.8272 5.2553 5.1430 7.0723 6.4151 4.4612 3.4804 2.4077 2.4584 1.7017 2.1432 1.8162 1.8483 4.1520 1.2832 3.2202 1.5088 3.9387 4.0632 3.1364 1.7404 3.2317 1.3541 2.7462 2.0745 1.9797 3.3938 1.7566 2.2800 3.0468 1.6606 1.0653 1.1229 1.1550 1.9579 1.5616 1.6656 1.1370 1.4251 1.2299 1.3483 1.2703 1.3735 8.6924 1.2260 2.2594 1.0945 1.0748 1.0423 1.0883 2.1914 1.0528 7.1861 6.4080 6.1721 9.7752 12.3975 1.0362 1.0610 1.0586 1.0803 1.0599 1.1018 1.1026 1.0974 1.1033 1.1062 1.0854 1.0882 1.0924 1.0961 1.1013
irintensity: 0.7664 0.2868 0.6762 2.3335 3.9319 0.4203 2.2319 1.3030 4.1831 6.7113 1.3585 2.8865 4.4489 1.6421 1.7450 6.0484 13.1036 0.5778 6.0862 0.5685 1.2149 3.0611 3.4427 14.2542 2.5908 0.2026 21.6171 10.5924 28.6709 42.8787 17.8156 15.8745 7.6664 9.8250 3.1417 3.8831 11.4934 1.7191 19.0223 53.4536 16.3435 4.7010 0.0660 2.1195 36.9807 0.4146 16.4656 181.2202 24.9014 6.4768 185.1289 16.1904 3.5470 11.0269 29.7331 121.6736 19.5824 130.4659 10.5823 62.3657 20.5847 36.9377 0.5306 3.7018 3.3579 24.6087 22.9166 17.5356 4.5341 13.5127 28.3651 1.6572 14.3479 111.5904 22.3381 22.5798 246.1015 25.0345 14.7977 15.3868 14.3999 12.4475 27.5056 12.3360 1.5059 32.9254 0.6761 26.1197 0.0725 6.3473 15.5540 18.8693 17.5655
temp: 298.150 k
press: 1.00000 atm
elementType: 8 8 8 7 6 6 6 6 6 6 6 6 6 6 6 6 6 6 1 1 1 1 1 1 1 1 1 1 1 1 1 1 1
symmnumber: 1
zpe: 680543.3 jmol-1
zpe.correction: 0.259205 hartree
zpe.thermalcorrener: 0.277408 hartree
zpe.thermalcorrenthalpy: 0.278352 hartree
zpe.thermalcorrgfe: 0.208995 hartree
zpe.sumelectzpe: -821.582504 hartree
zpe.sumelectthermal: -821.564302 hartree
zpe.sumelectthermalent: -821.563358 hartree
zpe.sumelectthermalfe: -821.632715 hartree
dipole: -7.4109 4.1954 -1.7302
dipole: 8.6901
quadrupole: -121.8054 -106.4323 -102.8232
quadrupole: 19.6561 2.5433 -1.6497
quadrupole: -11.4518 3.9213 7.5305 19.6561 2.5433 -1.6497
hfenergy: -821.8417097 hartree
pointgroup: C01 [X(C14H15N1O3)]
dipole: 0.70653 2.0009187 2.6807141 debye
polarizability: 180.0218755|26.0115206|144.9373173|19.7319802|31.7542846|168.1291622 unknown
InChI: InChI=1S/C14H15NO3/c1-2-18-14(17)12(9-6-10-15)13(16)11-7-4-3-5-8-11/h3-5,7-8,12H,2,6,9H2,1H3
charge 0 multiplicity 1
33 atoms
O  -1.932947 0.654813 1.219231
O  0.286511 0.306544 -1.59061
O  -3.142002 -0.750099 -0.197473
N  -1.167497 -4.461822 -3.549084
C  -0.696756 -1.091503 0.151133
C  -0.772968 -2.378013 -0.719367
C  0.347351 -0.071162 -0.383364
C  -1.29376 -2.183069 -2.173143
C  -2.060587 -0.411797 0.331498
C  1.445866 0.411136 0.514438
C  1.383787 0.328107 1.932127
C  2.589554 0.998194 -0.097165
C  -3.162264 1.478418 1.473171
C  2.44965 0.812724 2.719487
C  3.656971 1.46991 0.690212
C  -1.227093 -3.439214 -2.935681
C  3.590938 1.375804 2.101941
C  -3.316704 2.554867 0.39679
H  -0.380351 -1.407527 1.161715
H  0.23638 -2.82955 -0.752345
H  -1.433208 -3.098505 -0.202538
H  -0.699238 -1.407451 -2.687349
H  -2.340073 -1.831241 -2.143545
H  0.490452 -0.06728 2.425547
H  2.614665 1.069412 -1.189476
H  -4.034079 0.801715 1.500884
H  -2.979382 1.908113 2.470655
H  2.390046 0.756404 3.811626
H  4.538363 1.90917 0.210972
H  4.420871 1.743052 2.71582
H  -4.176566 3.204262 0.644873
H  -2.413061 3.184931 0.336396
H  -3.502567 2.101859 -0.591178
