program: Gaussian 09
title: 000222965
version: EM64L-G09RevD.01
frameworkgroup: C1[X(C11H14N2O2)]
method: RPBEPBE
basis: SDD
operation: Freq
keyword: #p
keyword: freq=noraman
keyword: PBEPBE/SDD
title: #p freq=noraman PBEPBE/SDD
converged: YES YES NO NO
title: Mulliken charges:
elementType: O O N N C C C C C C C C C C C H H H H H H H H H H H H H H
charge: -0.356324 -0.264618 -0.378989 -0.450781 0.100500 0.319667 0.223240 -0.318019 -0.343304 -0.344083 -0.280145 -0.220579 -0.652692 0.198066 -0.787837 0.199613 0.264832 0.219190 0.316098 0.305990 0.385833 0.230747 0.232682 0.235433 0.223170 0.203472 0.240579 0.240806 0.257452
chargesum: 0.00000
title: Mulliken charges with hydrogens summed into heavy atoms:
elementType: O O N N C C C C C C C C C C C
charge: -0.356324 -0.264618 -0.072999 -0.064948 0.100500 0.319667 0.223240 -0.118406 -0.027206 0.139939 -0.049397 0.012103 0.009383 0.198066 -0.049000
polarizability: 1.98623081e+02 4.18021740e+00 1.73890590e+02 -2.74086735e+00 -2.37646179e-01 7.31134817e+01
1716.lowfreq: -50.7220 -23.5971 -7.8275 -0.0003 0.0003 0.0004 6.1574 9.5194 42.2682
frequency: -50.7052 -22.2223 42.2637 77.1787 84.2347 97.5094 125.9678 149.0812 194.8013 239.5846 258.7522 297.0187 302.7728 359.7158 373.3261 406.1978 445.9019 488.9998 525.7028 539.6011 576.8744 591.4641 645.9465 667.9580 683.7064 756.0256 767.6565 780.0861 822.2187 846.2083 882.3719 896.1902 932.2754 952.1266 955.6221 995.0334 1007.5878 1029.5272 1034.9104 1054.8742 1083.2987 1114.9940 1141.4363 1161.0322 1180.5704 1231.6026 1243.5077 1273.4730 1284.8384 1312.1087 1351.5364 1372.1036 1377.5944 1388.8086 1433.5923 1437.3525 1455.9562 1464.9436 1470.8492 1475.0879 1482.5436 1509.5017 1513.0534 1570.5921 1588.4681 1621.9224 1643.5853 2982.1990 2991.4309 2991.9992 3068.3680 3076.8377 3089.0524 3098.8676 3118.1610 3136.5091 3138.5547 3145.6648 3163.5313 3188.9350 3567.3316
redmass: 1.0617 2.4553 6.4094 3.5323 3.2749 5.3423 3.3059 5.1177 1.9297 1.8596 4.5152 4.4904 3.6262 3.5099 3.5193 6.2408 3.3517 4.2322 3.2287 4.8713 1.2840 2.7928 5.7470 5.3530 4.8326 1.7913 1.5618 2.4426 4.0368 2.6856 1.4901 1.9832 4.9676 1.3544 1.1695 1.6525 1.3135 3.9013 1.6695 2.2207 2.2169 1.9508 1.7446 2.3425 1.1114 3.1189 1.7164 1.2835 1.8302 1.9949 1.3750 4.1753 1.3836 1.2189 2.3246 2.1433 1.2467 1.0467 1.0604 1.0700 1.1075 2.1011 2.6061 5.4193 4.5443 7.1032 2.3985 1.0362 1.0378 1.0673 1.0977 1.0979 1.0964 1.1012 1.0872 1.0990 1.0893 1.0838 1.0980 1.0956 1.0768
irintensity: 1.1475 0.1994 0.7999 0.2863 5.9674 7.5704 4.1939 4.4104 3.4076 2.2867 0.1651 0.0059 3.7439 20.1973 1.9026 4.7717 1.9124 8.9490 4.8547 7.6831 98.9863 8.8840 12.7018 1.5399 18.8218 56.8143 4.6910 22.2838 6.0840 4.6267 5.1077 9.9267 28.9664 0.1285 88.3264 16.4808 4.6782 4.3399 14.4224 12.6175 7.3551 3.8466 23.6510 8.3438 4.4659 58.2265 108.2189 0.4619 265.5637 74.2994 7.4302 92.8544 106.9653 14.3555 60.0612 172.7470 3.8046 17.5402 20.9597 9.3538 42.3859 196.6408 584.1420 7.0643 333.6500 113.7155 0.9076 31.0884 4.9415 52.5901 16.3872 13.3569 35.4858 28.5584 8.6746 23.4496 31.0746 339.8361 20.8637 12.8678 18.0902
temp: 298.150 k
press: 1.00000 atm
elementType: 8 8 7 7 6 6 6 6 6 6 6 6 6 6 6 1 1 1 1 1 1 1 1 1 1 1 1 1 1
symmnumber: 1
zpe: 615054.4 jmol-1
zpe.correction: 0.234262 hartree
zpe.thermalcorrener: 0.247646 hartree
zpe.thermalcorrenthalpy: 0.248590 hartree
zpe.thermalcorrgfe: 0.193633 hartree
zpe.sumelectzpe: -686.457534 hartree
zpe.sumelectthermal: -686.444150 hartree
zpe.sumelectthermalent: -686.443206 hartree
zpe.sumelectthermalfe: -686.498163 hartree
dipole: 5.5380 1.1909 -0.5592
dipole: 5.6922
quadrupole: -88.6368 -78.4608 -91.5147
quadrupole: 3.5451 -3.6632 0.1422
quadrupole: -2.4327 7.7433 -5.3106 3.5451 -3.6632 0.1422
hfenergy: -686.6917961 hartree
pointgroup: C01 [X(C11H14N2O2)]
dipole: 2.1643833 0.5730833 -0.0477378 debye
polarizability: 198.2427396|4.8061219|172.1149572|3.1177554|14.6605108|75.2694558 unknown
InChI: InChI=1S/C11H14N2O2/c1-3-12-11(15)9-6-4-5-7-10(9)13-8(2)14/h4-7,12-13H,3H2,1-2H3
charge 0 multiplicity 1
29 atoms
O  1.046028 -1.739533 -0.067426
O  -3.828886 -0.904932 -0.446364
N  2.633075 -0.087271 -0.389341
N  -1.485723 -1.068405 -0.215096
C  0.303294 0.589293 0.056391
C  -1.103013 0.276289 -0.027537
C  1.337387 -0.48405 -0.127139
C  0.683041 1.933926 0.321248
C  -2.060197 1.326365 0.085524
C  3.749203 -1.040746 -0.524716
C  -0.267891 2.961548 0.452055
C  -1.6420 2.648308 0.317311
C  4.833593 -0.830316 0.55219
C  -2.766156 -1.595119 -0.401628
C  -2.770657 -3.115547 -0.553603
H  1.740058 2.186542 0.469058
H  3.307046 -2.047287 -0.444776
H  4.18973 -0.94451 -1.536457
H  -3.117453 1.071572 -0.006359
H  2.832322 0.904451 -0.520498
H  -0.670561 -1.720536 -0.17317
H  0.052807 3.986228 0.664997
H  -2.395662 3.438287 0.409072
H  4.40974 -0.964318 1.562477
H  5.648251 -1.56473 0.41698
H  5.278419 0.180855 0.492966
H  -2.343382 -3.604228 0.341299
H  -2.168006 -3.428235 -1.425996
H  -3.807206 -3.455603 -0.690162
