program: Gaussian 09
title: 000222962
version: EM64L-G09RevD.01
frameworkgroup: C1[X(C6H12O3)]
method: RPBEPBE
basis: SDD
operation: Freq
keyword: #pfreq=noraman
keyword: PBEPBE/SDD
title: #p freq=noraman PBEPBE/SDD
converged: YES YES NO NO
title: Mulliken charges:
elementType: O O O C C C C C C H H H H H H H H H H H H
charge: -0.451154 -0.444363 -0.444400 -0.246845 -0.060599 -0.060526 -0.422067 -0.422075 -0.406788 0.276498 0.177127 0.177155 0.215743 0.225342 0.225348 0.215754 0.201240 0.216263 0.331573 0.348385 0.348390
chargesum: 0.00000
title: Mulliken charges with hydrogens summed into heavy atoms:
elementType: O O O C C C C C C
charge: -0.119582 -0.095979 -0.096010 0.029654 0.116527 0.116629 0.019019 0.019026 0.010715
polarizability: 7.53587412e+01 -3.91175801e-03 8.00487283e+01 8.83075944e-04 -3.84500641e-01 6.14219389e+01
1716.lowfreq: -15.6213 -0.0006 -0.0003 0.0003 19.7289 22.0357 110.1618 145.3451 232.5730
frequency: 110.1575 145.3303 232.5718 234.2962 265.8270 326.8200 359.9641 391.3290 399.3726 430.5969 456.2618 484.0294 510.3848 540.0124 549.9076 834.7784 844.1143 850.4476 902.3712 929.8736 983.6478 997.2253 1037.0538 1042.2535 1082.9254 1092.7631 1106.5592 1134.5290 1184.6121 1192.9616 1244.6552 1253.4968 1257.1796 1259.3496 1310.6003 1319.0548 1335.9652 1345.5072 1350.7447 1376.0657 1376.4404 1394.2404 1466.5594 1472.2841 1478.4145 2875.9010 2889.4926 2978.2774 2999.9359 3000.2830 3050.5550 3063.7867 3065.4860 3072.9829 3509.2580 3514.5149 3516.7615
redmass: 6.2942 2.7254 4.7332 3.7484 2.6490 2.0472 1.1939 4.5290 3.6604 3.0730 1.1959 1.3406 3.9190 1.9864 1.9765 1.8224 2.8324 1.4521 2.6094 2.4761 3.8064 3.0674 1.4360 3.3962 1.7937 2.0373 2.4569 1.4887 1.5416 1.3118 1.3223 1.3467 1.1584 1.1541 1.2418 1.3683 1.4073 1.3571 1.5205 1.1681 1.6528 1.6741 1.0922 1.0826 1.0930 1.0820 1.0822 1.0658 1.0624 1.0614 1.0954 1.0878 1.1018 1.1004 1.0655 1.0653 1.0652
irintensity: 3.7902 6.9699 20.6656 2.7097 7.5580 6.1227 1.6179 4.5523 24.3161 12.9392 184.0601 75.5722 25.2419 118.8399 0.6558 8.5981 24.8581 20.0689 36.1112 4.3981 104.1472 59.4823 1.7637 34.7804 21.8663 26.4166 4.8003 18.5429 13.3444 5.2321 2.8283 23.7275 47.3198 9.0388 4.7491 10.4368 0.0003 11.6575 31.3365 23.1347 28.0863 4.7799 6.0755 14.3150 13.3494 3.0721 128.8858 35.7271 20.8202 23.4372 46.2185 3.5335 23.2366 63.9286 8.9111 0.4677 11.7717
temp: 298.150 k
press: 1.00000 atm
elementType: 8 8 8 6 6 6 6 6 6 1 1 1 1 1 1 1 1 1 1 1 1
symmnumber: 1
zpe: 469120.2 jmol-1
zpe.correction: 0.178678 hartree
zpe.thermalcorrener: 0.187826 hartree
zpe.thermalcorrenthalpy: 0.188770 hartree
zpe.thermalcorrgfe: 0.145414 hartree
zpe.sumelectzpe: -460.749464 hartree
zpe.sumelectthermal: -460.740317 hartree
zpe.sumelectthermalent: -460.739372 hartree
zpe.sumelectthermalfe: -460.782729 hartree
dipole: -0.0003 0.3164 2.2966
dipole: 2.3183
quadrupole: -68.7314 -51.1127 -51.9987
quadrupole: -0.0080 0.0016 -3.3966
quadrupole: -11.4505 6.1683 5.2822 -0.0080 0.0016 -3.3966
hfenergy: -460.9281424 hartree
pointgroup: C01 [X(C6H12O3)]
dipole: 0.0007269 0.1412703 0.9010869 debye
dipolederiv: -0.6712163 -0.0013684 0.0011401 -0.0012896 -0.8447476 0.1601223 0.0013461 0.1889888 -0.1527927 -0.7761319 0.2694786 -0.0126791 0.2599729 -0.4164404 -0.1117628 -0.0161292 -0.1327798 -0.509886 -0.7840557 -0.2638666 0.0108638 -0.2543923 -0.4085297 -0.1121476 0.0139967 -0.1332259 -0.5098499 0.0877549 0.0034389 -0.0012282 0.0033476 0.5470301 -0.1588011 -0.0012607 -0.1659594 0.1718256 0.4579023 -0.2439498 -0.0712031 -0.1740536 0.3098723 0.1216062 -0.0262536 0.0589229 0.4367108 0.464182 0.2416185 0.073011 0.1716947 0.3035983 0.1206577 0.0270963 0.0587633 0.4366834 0.0127964 -0.0094021 0.0317686 0.0724411 -0.014641 0.0073997 -0.0156119 0.0004055 0.1077892 0.0117895 0.0090172 -0.0317201 -0.0728192 -0.0136669 0.0077941 0.0155783 0.0001089 0.1078101 0.0721752 -0.0000453 -0.000129 -0.0000452 0.0657633 -0.0129679 0.0002689 0.0382696 0.1645644 0.0761374 -0.0004711 0.0001065 -0.0004711 0.0114415 0.0068424 0.0001609 0.0150946 -0.0826905 -0.0229352 0.0118168 0.0638265 0.0064426 -0.0080837 0.024933 0.0440182 -0.0045994 -0.2571735 -0.0231383 -0.0115879 -0.0632662 -0.006217 -0.0077887 0.0258242 -0.0438985 -0.0039851 -0.2571773 0.0833458 0.0205056 -0.0150196 0.0257753 0.0510868 -0.0206891 0.0316164 0.0182913 -0.1451923 -0.1105217 -0.0996981 -0.0467222 -0.0861781 0.002953 -0.0232089 -0.0705035 -0.0310539 0.065389 -0.1077527 0.1013645 0.0462886 0.0878482 0.0001502 -0.0238638 0.0699406 -0.0320488 0.0654332 0.0826488 -0.0209847 0.0148138 -0.0262292 0.0517834 -0.0208804 -0.0312327 0.018779 -0.145205 0.0181536 0.0005942 0.0002026 0.0005684 0.093201 0.0178255 -0.0004032 -0.0608698 -0.1911416 0.0468395 -0.0017951 0.0004064 -0.0017741 -0.1846996 0.0542961 0.0006559 0.0866462 0.0653997 0.340922 -0.0002853 -0.0009957 -0.0002974 0.2956143 -0.1338979 -0.0003276 -0.0466917 -0.001086 0.3695574 -0.0927409 0.0320591 -0.043633 0.0840725 0.0351865 0.0431001 0.063115 0.3153152 0.3715467 0.088361 -0.0315237 0.0393092 0.082031 0.035732 -0.0421577 0.0638287 0.3152742 unknown
polarizability: 75.358976|0.0334476|80.0277171|-0.000495|-0.7310274|61.4427154 unknown
InChI: InChI=1S/C6H12O3/c7-4-2-1-3-5(8)6(4)9/h4-9H,1-3H2
charge 0 multiplicity 1
21 atoms
O  -0.016209 -2.236752 0.297329
O  2.463034 -0.781707 -0.244206
O  -2.473392 -0.744482 -0.245736
C  -0.005629 -0.818576 -0.163454
C  1.278521 -0.109017 0.299079
C  -1.279224 -0.089671 0.298328
C  1.291955 1.35489 -0.169877
C  -1.270417 1.374369 -0.170577
C  0.016189 2.098042 0.29956
H  -0.006043 -0.91849 -1.2633
H  1.304739 -0.139099 1.417153
H  -1.306677 -0.119282 1.416356
H  1.353372 1.362625 -1.275433
H  2.204149 1.847823 0.211158
H  -2.175296 1.880902 0.210055
H  -1.33116 1.383182 -1.276178
H  0.016459 2.178914 1.406009
H  0.024172 3.132072 -0.090953
H  -0.016253 -2.240801 1.291973
H  2.311985 -1.760845 -0.160862
H  -2.337277 -1.725797 -0.162223
