program: Gaussian 09
title: 000222963
version: EM64L-G09RevD.01
frameworkgroup: C1[X(C9H9BrO4)]
method: RPBEPBE
basis: SDD
operation: Freq
keyword: #p
keyword: freq=noraman
keyword: PBEPBE/SDD
title: #p freq=noraman PBEPBE/SDD
converged: YES YES NO NO
title: Mulliken charges:
elementType: Br O O O O C C C C C C C C C H H H H H H H H H
charge: 0.054126 -0.290126 -0.261800 -0.465027 -0.227856 0.257719 0.224450 0.368171 -0.440104 -0.278525 -0.391373 0.097551 -0.536531 -0.492513 0.303329 0.280033 0.231383 0.244831 0.231631 0.230914 0.237163 0.236958 0.385599
chargesum: 0.00000
title: Mulliken charges with hydrogens summed into heavy atoms:
elementType: Br O O O O C C C C C C C C C
charge: 0.054126 -0.290126 -0.261800 -0.079428 -0.227856 0.257719 0.224450 0.368171 -0.136775 0.001508 -0.391373 0.097551 0.171313 0.212522
polarizability: 2.03631512e+02 -7.32347509e+00 1.52668850e+02 1.11284376e-02 4.78672823e-03 5.80050184e+01
1716.lowfreq: -34.3530 -0.0004 0.0003 0.0005 3.2899 4.9123 7.7047 38.8630 52.5722
frequency: -34.3467 38.8285 52.5380 103.4302 136.3277 150.8994 156.4799 189.2141 196.7008 217.3041 250.5670 269.6087 299.5922 322.2851 370.9278 379.6219 455.6746 458.7795 519.6351 559.0409 602.7149 614.6904 633.7297 680.1503 708.5831 733.0650 742.3078 875.9184 890.5343 894.4429 976.8864 978.2919 1023.8005 1107.8879 1113.9932 1140.0023 1145.8838 1158.6184 1177.8341 1243.2790 1277.9917 1306.4942 1343.5327 1398.2713 1437.1927 1445.0880 1459.9184 1461.9117 1468.0821 1474.2375 1490.7831 1546.6914 1600.1227 1651.4163 2967.0954 3007.5009 3057.7682 3119.1718 3127.9175 3132.7148 3180.8095 3193.4067 3537.6147
redmass: 3.0039 14.2084 4.7222 4.4993 5.3496 8.2791 6.8466 1.3113 4.0936 1.8677 8.4387 1.3793 5.1406 6.1831 6.2044 5.5532 3.1683 6.0378 5.5006 1.6436 6.8424 2.7988 5.1640 6.0107 4.3529 5.2679 4.7180 1.5797 8.3351 1.4490 8.7674 7.5934 3.3929 1.2417 1.2566 2.0251 1.4835 1.3751 2.6287 1.7866 1.8080 3.0828 6.2978 6.2212 1.2339 1.2551 1.0520 1.0618 1.0491 1.1904 2.4365 9.1165 6.9288 8.7354 1.0325 1.0283 1.1043 1.1053 1.1002 1.1057 1.0921 1.0900 1.0642
irintensity: 6.7359 1.6463 3.1728 1.7903 2.1875 0.1382 1.8562 0.1600 3.3221 0.4764 0.8244 0.6113 9.7533 0.4490 9.6768 1.8819 9.2157 0.6782 54.0283 54.3924 7.3398 91.3523 27.1520 4.3858 7.8392 25.1772 12.8045 8.4489 40.5649 39.6848 113.1730 98.0503 273.0836 0.0803 0.0362 119.9778 145.1910 4.8208 20.6423 110.9282 138.0327 201.8609 27.7854 6.2957 22.1024 8.5417 14.1508 29.8143 12.7514 139.2996 136.9083 163.2402 121.0059 309.8632 52.9060 69.3165 38.5553 31.3099 21.0970 23.3381 0.2790 3.9564 49.8642
temp: 298.150 k
press: 1.00000 atm
elementType: 35 8 8 8 8 6 6 6 6 6 6 6 6 6 1 1 1 1 1 1 1 1 1
symmnumber: 1
zpe: 432185.7 jmol-1
zpe.correction: 0.164611 hartree
zpe.thermalcorrener: 0.178212 hartree
zpe.thermalcorrenthalpy: 0.179156 hartree
zpe.thermalcorrgfe: 0.123048 hartree
zpe.sumelectzpe: -661.641627 hartree
zpe.sumelectthermal: -661.628026 hartree
zpe.sumelectthermalent: -661.627082 hartree
zpe.sumelectthermalfe: -661.683190 hartree
dipole: 5.9425 2.0953 0.0114
dipole: 6.3011
quadrupole: -82.0812 -77.6668 -92.0986
quadrupole: 2.8477 -0.0401 0.0381
quadrupole: 1.8677 6.2820 -8.1497 2.8477 -0.0401 0.0381
hfenergy: -661.8062381 hartree
pointgroup: C01 [X(C9H9Br1O4)]
dipole: -1.9589189 1.515494 0.1077519 debye
dipolederiv: -0.320531 0.3427902 0.0151484 0.3436716 -0.3340875 -0.0170519 0.016119 -0.0178408 0.0009575 -0.9255319 0.6464337 0.0285682 0.6650054 -1.1117872 -0.0177359 0.0275705 -0.0155653 -0.2663836 -1.8885056 -0.3912578 0.176797 -0.6670193 -0.4477332 0.0731378 0.1899467 0.0461023 -0.3137824 -0.3054198 -0.0602616 -0.0090588 -0.3007255 -1.3953234 0.080297 0.0040174 0.0572203 -0.4346733 -1.2409205 -0.0394034 0.0882982 -0.0000676 -0.5639871 0.0138787 0.0866612 0.0179897 -0.3186245 0.6412353 -0.9008936 -0.0083391 -1.021405 0.2326838 0.0871789 -0.0019098 0.0745132 0.0357369 1.457123 0.5209799 -0.1593605 0.9465315 0.4017198 -0.1070229 -0.1814363 -0.065236 0.1337439 -0.9961398 -0.3102654 0.1168725 -0.2895174 -0.4463135 0.0525976 0.1163847 0.0532554 0.0353108 0.1908901 0.3402677 -0.0513233 -0.0741939 -0.1188737 0.0051886 -0.0289849 -0.0329096 -0.148297 -0.7770872 -0.0300153 0.0671077 0.2557744 -0.0716325 -0.0276129 0.0521818 -0.0006908 -0.1224491 0.8626144 -0.5034771 -0.075778 -0.2140342 0.7523174 -0.0224308 -0.0922429 0.0066906 -0.1366667 1.8488001 0.4673519 -0.1758829 0.474042 1.6896935 -0.1239294 -0.1773347 -0.1233032 0.2427314 0.1931771 0.0226636 0.0103886 -0.3139579 0.811693 0.0031939 0.0289051 -0.029447 0.3133113 1.0328926 0.1102164 -0.0779329 -0.1857377 0.2167341 0.0225537 -0.0631137 -0.0064357 0.3047392 0.1444941 0.0360751 0.0002926 0.0402609 0.0087006 0.0040013 -0.0008032 0.0046565 0.1641855 0.0984025 -0.008448 0.0070627 -0.0184506 -0.0003096 0.0103867 0.0084111 0.0093417 0.1654043 0.0439669 -0.1315784 -0.1153782 0.0353024 -0.0421911 -0.0283035 -0.0837067 -0.0604651 -0.0553051 -0.1009909 0.1251841 0.0141894 0.0680938 0.034185 -0.0016352 0.0171947 -0.0069819 0.1213224 0.0778751 -0.1064212 0.1020582 0.0471794 -0.0315376 0.0154664 0.0528451 0.078236 -0.0991034 -0.0743223 -0.0875433 0.0237636 -0.1496392 -0.0584741 0.0242467 0.0272493 0.018165 0.1159481 -0.0398397 -0.0005305 0.0049236 0.1456713 0.0614996 0.0803196 -0.0601863 0.0842879 -0.0705707 -0.0316466 -0.0194267 -0.0103573 0.1309887 0.0411827 -0.1201251 0.0399784 -0.0948163 -0.0590707 0.109464 -0.0224403 0.0279401 0.0822268 0.3718411 -0.0065993 0.0222535 0.003233 0.3915354 unknown
polarizability: 201.7132618|-9.7469435|153.0887468|-13.4087574|-3.9222803|59.5033721 unknown
InChI: InChI=1S/C9H9BrO4/c1-13-7-3-5(9(11)12)6(10)4-8(7)14-2/h3-4,11H,1-2H3
charge 0 multiplicity 1
23 atoms
Br 2.631819 -2.636672 -0.186748
O  -2.338097 1.05402 0.106075
O  -2.461776 -1.884315 0.277222
O  2.446602 2.142045 -0.407019
O  3.748095 0.226707 -0.425426
C  -1.163452 0.283442 0.035905
C  -1.298686 -1.142419 0.124677
C  1.302006 0.044093 -0.188062
C  0.118532 0.835888 -0.115025
C  -0.128634 -1.9355 0.051948
C  1.147181 -1.367724 -0.101694
C  2.605191 0.732846 -0.346165
C  -2.196398 2.51008 0.011932
C  -3.804712 -1.277041 0.378549
H  0.250989 1.916866 -0.182004
H  -0.256873 -3.018409 0.120331
H  -1.581733 2.907345 0.842208
H  -3.221359 2.901779 0.086587
H  -1.751001 2.807088 -0.95673
H  -4.474164 -2.143353 0.490772
H  -4.052643 -0.709676 -0.532453
H  -3.874919 -0.615508 1.25652
H  3.351534 2.539218 -0.5137
