program: Gaussian 09
title: 000222960
version: EM64L-G09RevD.01
frameworkgroup: C1[X(C12H13NO)]
method: RPBEPBE
basis: SDD
operation: Freq
keyword: #p
keyword: freq=noraman
keyword: PBEPBE/SDD
title: #p freq=noraman PBEPBE/SDD
converged: YES YES NO NO
title: Mulliken charges:
elementType: O N C C C C C C C C C C C C H H H H H H H H H H H H H
charge: -0.229069 -0.008651 0.185994 -0.448016 -0.448077 -0.340487 -0.340440 0.449478 -0.283620 -0.399496 -0.399857 -0.232983 -0.255321 -0.239923 0.231994 0.231187 0.231250 0.232064 0.218006 0.225302 0.225275 0.217853 0.254754 0.230313 0.230650 0.228785 0.233036
chargesum: 0.00000
title: Mulliken charges with hydrogens summed into heavy atoms:
elementType: O N C C C C C C C C C C C C
charge: -0.229069 -0.008651 0.185994 0.015165 0.015236 0.102820 0.102688 0.449478 -0.283620 -0.144742 -0.169544 -0.002333 -0.026536 -0.006887
polarizability: 1.59105428e+02 -4.34289534e+00 1.33445444e+02 2.84354803e-02 3.75264170e-02 8.72044515e+01
1716.lowfreq: -13.7516 -12.4726 -0.0005 -0.0004 0.0005 5.2388 41.7074 98.7943 102.5064
frequency: 41.5927 98.7937 102.4956 130.1899 146.4060 248.3374 253.1827 268.9492 283.9771 348.8803 398.3950 405.0256 445.1041 450.1761 522.6877 541.2243 576.4282 617.2334 640.9444 667.0573 705.8658 765.0300 789.3901 800.9312 852.8806 893.5407 898.6008 921.5898 930.2062 978.2280 990.3394 999.2334 1005.3176 1021.3273 1021.9207 1034.5876 1075.5451 1087.1941 1102.5289 1128.6460 1175.2969 1177.8996 1197.6465 1208.3405 1231.2341 1272.1360 1272.9184 1314.8286 1325.1486 1335.1831 1343.5629 1370.6829 1379.5808 1435.4465 1438.1993 1449.5493 1460.4302 1463.8088 1482.6449 1591.2251 1611.7921 2182.3450 2950.7738 2954.4276 3008.0161 3009.5413 3072.9216 3076.1588 3081.4297 3084.4385 3121.1081 3130.2019 3140.9505 3150.6056 3166.6770
redmass: 4.2222 4.9175 3.8547 10.0511 4.0380 1.9594 3.3067 6.2214 4.0417 2.4457 2.6219 2.8315 3.1545 8.5922 3.3564 2.8605 4.8634 6.3573 3.1531 5.7489 1.7714 1.8510 3.9774 1.5856 1.2461 2.1897 4.4237 2.5292 1.5428 1.3822 6.1543 1.3170 2.1572 2.5519 1.8096 2.1261 4.8398 1.6684 4.9115 2.3946 1.0514 1.0739 1.2293 2.6656 1.2779 1.3116 1.4488 1.2949 1.3449 1.3612 1.2027 1.3362 5.3351 2.2388 1.0836 1.0992 1.0775 1.0904 2.1421 6.0402 6.0179 12.6442 1.0688 1.0683 1.0594 1.0606 1.0994 1.0999 1.0985 1.0994 1.0863 1.0867 1.0917 1.0959 1.1016
irintensity: 0.4306 1.3766 0.0948 4.1605 3.2561 1.0293 4.2533 1.4831 1.6995 6.5751 0.1457 0.0086 0.3902 3.8075 12.7135 12.3310 3.8336 0.0401 0.3931 0.3894 51.0624 48.0440 11.2021 0.0554 0.1677 1.6470 8.8590 1.0340 4.1410 0.1105 0.7926 0.1477 3.8659 15.0780 21.7419 7.1928 37.5089 8.8061 5.9346 11.7400 0.0387 2.2686 0.3756 2.4678 14.9324 4.2063 0.2413 0.0459 1.5660 11.3877 3.9401 3.2979 1.5031 12.2312 7.0155 6.9092 3.8192 12.5309 26.6713 1.2484 8.8438 6.8302 25.8679 68.6061 19.9536 11.4230 36.1057 12.8008 11.8968 37.5922 8.6318 0.3178 14.5764 26.3949 21.2077
temp: 298.150 k
press: 1.00000 atm
elementType: 8 7 6 6 6 6 6 6 6 6 6 6 6 6 1 1 1 1 1 1 1 1 1 1 1 1 1
symmnumber: 1
zpe: 579334.3 jmol-1
zpe.correction: 0.220657 hartree
zpe.thermalcorrener: 0.232702 hartree
zpe.thermalcorrenthalpy: 0.233646 hartree
zpe.thermalcorrgfe: 0.182346 hartree
zpe.sumelectzpe: -594.002589 hartree
zpe.sumelectthermal: -593.990543 hartree
zpe.sumelectthermalent: -593.989599 hartree
zpe.sumelectthermalfe: -594.040900 hartree
dipole: 2.2866 -2.4987 0.0018
dipole: 3.3870
quadrupole: -82.6756 -90.9475 -80.1355
quadrupole: 0.1327 0.0092 0.0163
quadrupole: 1.9106 -6.3613 4.4507 0.1327 0.0092 0.0163
hfenergy: -594.2232454 hartree
pointgroup: C01 [X(C12H13N1O1)]
dipole: -0.9194437 0.9617582 -0.0732619 debye
polarizability: 159.2714239|-3.8098934|133.0008554|0.2455484|-3.571957|87.4830436 unknown
InChI: InChI=1S/C12H13NO/c13-10-12(6-8-14-9-7-12)11-4-2-1-3-5-11/h1-5H,6-9H2
charge 0 multiplicity 1
27 atoms
O  3.28614 1.171274 -0.16452
N  1.325481 -2.737576 0.135428
C  0.615288 -0.163595 -0.0626
C  1.253966 0.407336 -1.382981
C  1.252778 0.603183 1.155129
C  2.793251 0.401555 -1.31869
C  2.792297 0.59002 1.09452
C  -0.923845 -0.008281 -0.074328
C  0.99294 -1.595044 0.047591
C  -1.795563 -1.121429 0.014214
C  -1.489054 1.290541 -0.175825
C  -3.197788 -0.942426 0.001268
C  -2.888481 1.47008 -0.188249
C  -3.75106 0.352709 -0.099744
H  0.901588 1.446499 -1.510553
H  0.903258 -0.177359 -2.253498
H  0.901648 0.158798 2.104751
H  0.899677 1.649259 1.120615
H  3.17962 -0.639683 -1.269318
H  3.224038 0.899179 -2.20278
H  3.22016 1.220551 1.890938
H  3.181239 -0.445079 1.209811
H  -1.382122 -2.132951 0.093159
H  -0.841671 2.172637 -0.246381
H  -3.854843 -1.816394 0.070221
H  -3.305184 2.48034 -0.26698
H  -4.837658 0.491453 -0.109398
