program: Gaussian 09
title: 000018882
version: EM64L-G09RevD.01
frameworkgroup: C1[X(C11H13N3O2)]
method: RPBEPBE
basis: SDD
operation: Freq
keyword: #p
keyword: freq=noraman
keyword: PBEPBE/SDD
title: #p freq=noraman PBEPBE/SDD
converged: YES YES NO NO
title: Mulliken charges:
elementType: O O N N N C C C C C C C C C C C H H H H H H H H H H H H H
charge: -0.224499 -0.217206 -0.399915 -0.089996 0.012160 0.418930 0.123566 -0.498801 0.227564 -0.435765 -0.537630 -0.305652 0.394756 -0.378864 -0.623773 -0.612868 0.226945 0.188198 0.275603 0.313048 0.320493 0.237351 0.283577 0.227863 0.246198 0.184299 0.186174 0.227881 0.230363
chargesum: 0.00000
title: Mulliken charges with hydrogens summed into heavy atoms:
elementType: O O N N N C C C C C C C C C C C
charge: -0.224499 -0.217206 -0.086867 -0.089996 0.012160 0.418930 0.123566 -0.083658 0.227564 -0.160162 -0.217137 -0.068301 0.394756 -0.095287 0.034588 0.031549
polarizability: 2.05807014e+02 1.74919730e+01 1.78313534e+02 -1.08211855e+01 5.96921176e+00 8.20304736e+01
1716.lowfreq: -4.2514 -0.0012 -0.0008 -0.0007 6.0621 12.6126 36.0787 54.1791 66.1054
frequency: 36.0509 54.1743 66.1000 80.4878 113.0621 163.2894 190.2222 229.0116 236.4604 270.1292 280.3549 322.5146 338.1251 346.1558 353.4182 426.2192 428.3933 468.5366 524.9488 542.0141 565.2555 569.0129 615.4974 650.9448 704.8618 732.7270 761.1667 774.7273 796.2366 813.7845 823.6256 826.2108 901.5209 948.7345 968.7324 975.4643 1020.3470 1035.6774 1040.5635 1090.1255 1092.5738 1107.0464 1133.0681 1136.7571 1172.7593 1214.8339 1228.3740 1236.9753 1262.0138 1268.6653 1291.1540 1320.7447 1363.0595 1367.2267 1399.0648 1417.7878 1425.9980 1441.0364 1459.4367 1460.3127 1472.7566 1474.7315 1476.0526 1483.1602 1486.0356 1566.0733 1587.5219 1629.1757 2823.3551 2848.0459 2863.1459 2985.8826 3021.2480 3030.2741 3080.4368 3089.1000 3147.3764 3187.8918 3191.0970 3223.9818 3607.2518
redmass: 3.4915 8.7105 3.1132 4.5208 5.6937 3.5244 4.7670 1.3751 1.0649 2.6275 4.9046 2.9100 3.3330 4.2637 3.9336 3.0891 2.9675 3.4940 5.5077 1.4354 3.1703 3.7114 3.7261 5.9381 5.7178 6.4999 4.9601 4.5967 2.3160 3.3124 2.1565 1.8911 5.3140 1.4634 1.3201 1.8164 2.2811 1.5672 2.0391 1.4946 1.4210 3.3707 1.3729 1.3117 1.8982 7.6340 1.8717 1.6397 2.6112 1.7942 2.3897 2.1328 6.1487 1.5694 4.3580 1.1438 2.3977 1.1797 1.0747 1.0662 1.6596 1.8295 1.0764 5.2524 1.0580 6.6216 6.7020 7.2000 1.0707 1.0571 1.0572 1.0856 1.0724 1.0720 1.1011 1.1010 1.0906 1.0943 1.0933 1.0986 1.0810
irintensity: 0.0997 0.1255 0.3913 1.4021 0.2474 1.6011 0.9202 1.5150 0.7442 1.5824 6.5592 7.4411 3.8150 1.2569 4.7409 6.7273 5.8012 0.4223 2.5721 78.3965 18.1996 11.5647 3.9854 14.9865 28.4328 8.8845 5.8522 3.2305 29.4283 10.3778 54.7390 10.6885 3.5870 19.1012 1.4884 7.9137 38.0833 18.8917 30.2002 33.6329 14.5500 6.0364 20.9481 7.5698 3.9895 431.2464 5.6171 14.5803 3.7547 10.8487 7.2405 3.6651 98.5142 60.6767 65.2735 4.6987 2.4417 4.6532 3.0452 14.8155 2.9221 19.2172 11.4223 5.6931 12.7254 8.0632 9.1987 35.4609 71.2999 65.8101 272.4760 23.5822 33.1979 30.4587 25.5467 35.7985 10.0935 2.8754 7.9153 0.8583 81.1585
temp: 298.150 k
press: 1.00000 atm
elementType: 8 8 7 7 7 6 6 6 6 6 6 6 6 6 6 6 1 1 1 1 1 1 1 1 1 1 1 1 1
symmnumber: 1
zpe: 599080.1 jmol-1
zpe.correction: 0.228178 hartree
zpe.thermalcorrener: 0.242746 hartree
zpe.thermalcorrenthalpy: 0.243690 hartree
zpe.thermalcorrgfe: 0.185943 hartree
zpe.sumelectzpe: -740.412711 hartree
zpe.sumelectthermal: -740.398143 hartree
zpe.sumelectthermalent: -740.397199 hartree
zpe.sumelectthermalfe: -740.454946 hartree
dipole: 5.8361 6.4522 0.2219
dipole: 8.7029
quadrupole: -101.2882 -82.3960 -94.5514
quadrupole: -12.3469 -1.3137 1.0950
quadrupole: -8.5430 10.3492 -1.8062 -12.3469 -1.3137 1.0950
hfenergy: -740.6408887 hartree
pointgroup: C01 [X(C11H13N3O2)]
dipole: 2.3050182 2.4661521 -0.5731827 debye
polarizability: 202.2230253|13.7629003|176.9969894|-26.4510119|-10.9864965|86.9310067 unknown
InChI: InChI=1S/C11H13N3O2/c1-13(2)7-8-6-12-11-4-3-9(14(15)16)5-10(8)11/h3-6,12H,7H2,1-2H3
charge 0 multiplicity 1
29 atoms
O  -3.941312 -1.205408 0.868757
O  -2.193741 -2.616807 0.478757
N  0.778658 2.853823 -0.475938
N  2.746541 -1.365043 0.136421
N  -2.702969 -1.430663 0.562582
C  1.735803 0.779498 -0.639648
C  0.333453 0.625753 -0.282559
C  2.72331 -0.324184 -0.922877
C  -0.239297 1.947754 -0.187496
C  1.96647 2.147969 -0.744831
C  -0.478103 -0.502392 -0.028802
C  -1.598622 2.162409 0.143018
C  -1.829249 -0.269825 0.295069
C  -2.398347 1.035741 0.383897
C  3.204424 -0.849133 1.441794
C  3.496099 -2.564566 -0.28673
H  2.44288 -0.835129 -1.866309
H  3.737616 0.125666 -1.093467
H  2.885652 2.674789 -0.99487
H  0.682044 3.866985 -0.4878
H  -0.070488 -1.515188 -0.061123
H  -2.022369 3.169681 0.211131
H  -3.455402 1.130404 0.643533
H  3.115924 -1.64433 2.20274
H  2.568864 -0.002888 1.753451
H  4.268258 -0.498025 1.425365
H  4.584956 -2.369697 -0.463659
H  3.063707 -2.966442 -1.220729
H  3.41284 -3.344751 0.490223
