program: Gaussian 09
title: 000222956
version: EM64L-G09RevD.01
frameworkgroup: C1[X(C8H9NS)]
method: RPBEPBE
basis: SDD
operation: Freq
keyword: #pfreq=noraman
keyword: PBEPBE/SDD
title: #p freq=noraman PBEPBE/SDD
converged: YES YES NO NO
title: Mulliken charges:
elementType: S N C C C C C C C C H H H H H H H H H
charge: 0.202658 -0.013877 0.473943 -0.262781 -0.033359 -0.354798 -0.554769 -0.796882 -0.753924 -0.113069 0.255809 0.267022 0.263410 0.247141 0.232265 0.222203 0.242047 0.239410 0.237551
chargesum: 0.00000
title: Mulliken charges with hydrogens summed into heavy atoms:
elementType: S N C C C C C C C C
charge: 0.202658 -0.013877 0.473943 -0.262781 -0.033359 -0.098988 -0.024337 -0.095273 -0.034917 -0.113069
polarizability: 1.31416780e+02 -1.62598359e+00 1.05163865e+02 2.09988061e+00 3.37600096e+00 6.98435939e+01
1716.lowfreq: -11.3806 -10.7547 -0.0024 -0.0018 0.0013 3.4789 16.5188 62.2504 76.5033
frequency: 15.7819 62.1943 76.5016 101.4147 167.7232 195.8177 240.5819 259.1089 318.1187 349.7746 369.0348 428.8099 480.6142 528.2608 557.5819 609.3383 636.9297 707.4109 834.1843 849.3130 909.7535 960.5590 994.6483 1015.8176 1038.7192 1042.4701 1131.6281 1171.3671 1210.1346 1222.5228 1299.7699 1365.6261 1400.8812 1402.1713 1439.3079 1459.5836 1468.6695 1469.6284 1475.3899 1543.7691 1603.9953 2195.7021 2978.0688 2980.1851 2994.2260 3048.4519 3056.1619 3058.5032 3086.9500 3087.2704 3159.6408
redmass: 4.7684 1.1914 3.7409 1.0622 5.2513 2.9519 2.7248 2.7110 5.3797 2.9087 4.4158 5.8485 4.8996 6.1537 4.3074 3.5109 5.8278 4.8788 2.6835 1.3185 4.9292 1.6939 1.7339 1.9958 1.4793 1.4308 2.7877 3.8046 1.5759 1.1660 1.4626 3.7281 1.2346 1.2904 1.0877 1.0435 1.0629 1.1020 1.0813 5.6675 6.1921 12.4130 1.0366 1.0374 1.0599 1.0991 1.0983 1.0978 1.0985 1.0981 1.0948
irintensity: 4.3790 0.9312 2.1209 0.5839 2.4248 3.4859 4.5125 0.6358 1.1111 0.6261 0.3484 0.5734 9.8480 1.9127 3.8314 2.6553 4.5888 8.1781 2.4319 22.9479 6.5584 0.8233 2.8602 5.5568 2.5834 9.5680 14.5183 2.3865 11.3738 6.7733 0.1678 5.4540 12.7063 3.6054 17.1514 16.5776 15.7823 10.4300 23.1555 10.7776 5.7586 8.6718 38.6846 25.2544 9.6880 1.5776 17.0392 17.0643 11.1734 25.4873 7.6380
temp: 298.150 k
press: 1.00000 atm
elementType: 16 7 6 6 6 6 6 6 6 6 1 1 1 1 1 1 1 1 1
symmnumber: 1
zpe: 383164.3 jmol-1
zpe.correction: 0.145940 hartree
zpe.thermalcorrener: 0.157080 hartree
zpe.thermalcorrenthalpy: 0.158024 hartree
zpe.thermalcorrgfe: 0.107234 hartree
zpe.sumelectzpe: -762.305033 hartree
zpe.sumelectthermal: -762.293893 hartree
zpe.sumelectthermalent: -762.292949 hartree
zpe.sumelectthermalfe: -762.343739 hartree
dipole: 3.1783 1.8257 -2.4731
dipole: 4.4216
quadrupole: -71.1354 -63.0568 -70.0370
quadrupole: -3.6805 12.2302 3.0308
quadrupole: -3.0590 5.0196 -1.9606 -3.6805 12.2302 3.0308
hfenergy: -762.450973 hartree
pointgroup: C01 [X(C8H9N1S1)]
dipole: -1.3331435 -0.624586 -0.9267135 debye
dipolederiv: -0.2271637 0.0085492 0.0820796 -0.0325404 -0.3242633 0.0851847 0.0892991 0.081276 0.0490379 -0.3135999 -0.0134698 0.0054783 -0.01679 -0.2258678 0.0022422 -0.1602521 -0.0247974 -0.2048774 0.0417128 -0.1939098 0.0192097 -0.0007087 0.0956518 -0.0060903 -0.0269087 -0.0153666 0.00161 0.0815993 -0.1362154 -0.0241849 -0.2195002 0.2653262 -0.071613 -0.0050658 -0.0396054 -0.2906621 0.3177785 0.101098 -0.1710948 0.0676422 0.3078079 -0.1294582 -0.1575315 -0.1334457 -0.1160492 -0.1751639 0.1721972 -0.0562708 0.1373077 -0.2952654 -0.007766 -0.0332904 -0.0213263 -0.1633083 0.2456978 0.0310385 -0.0476463 0.0895662 0.1830292 0.0016698 -0.0297827 0.0068854 0.1586544 0.0686394 0.027986 0.0078932 0.0524911 -0.056874 0.026972 -0.0071955 0.0752919 0.063259 -0.0699471 0.0276653 0.0414654 0.0222602 0.0175563 0.0085081 0.0427234 0.0094533 0.092974 -0.0396647 0.008535 0.1261454 0.0055602 -0.0533387 0.0205602 0.2209681 0.0341101 0.0383249 0.0284307 -0.0629408 0.0520028 -0.0954018 0.007607 0.0614411 0.0683245 0.0525831 0.1576261 0.0643899 -0.0092185 -0.0390207 -0.058235 0.0169726 0.0953905 -0.0185859 0.040453 0.0542286 -0.0200342 0.0321154 0.0003267 0.0704073 0.0165101 -0.106105 -0.0162377 -0.051224 0.0733446 0.0961798 0.041675 -0.0077036 0.0299101 0.0200355 0.0372837 -0.0279031 0.0905583 -0.0919919 0.0210023 -0.0977053 -0.0739316 -0.0427558 -0.0759359 -0.0572639 -0.0522435 -0.0880945 0.0673108 -0.1163089 0.0530946 0.0806813 -0.0193918 0.0810665 0.0285328 0.1016002 -0.0248281 0.0584708 0.0354901 -0.001803 -0.015296 0.0499801 -0.0246342 -0.1231332 0.0432925 -0.1199834 0.0058333 -0.0044888 0.0543847 -0.0290822 0.0769576 0.0621176 0.0721769 -0.0996139 0.0859658 -0.0506093 -0.0345494 -0.0430763 0.0489484 -0.1167588 -0.0175015 0.0614676 0.0684029 0.0420946 0.0968235 unknown
polarizability: 130.5170801|-5.254331|105.2857485|-1.916793|-6.1275097|70.6214102 unknown
InChI: InChI=1S/C8H9NS/c1-6-5-7(2)10-8(6)3-4-9/h5H,3H2,1-2H3
charge 0 multiplicity 1
19 atoms
S  -0.770875 1.490568 -0.499965
N  3.438091 0.576265 1.151082
C  -0.311465 -1.091712 -0.07149
C  0.337171 0.05748 -0.504679
C  -2.133525 0.456033 0.097688
C  -1.703489 -0.849621 0.259221
C  1.782468 0.23608 -0.922349
C  0.337273 -2.451053 0.073933
C  -3.490326 1.056139 0.338992
C  2.703864 0.429439 0.221968
H  -2.371201 -1.641308 0.612033
H  1.892765 1.099374 -1.604802
H  2.123272 -0.651163 -1.489895
H  0.43321 -2.728677 1.140616
H  -0.269122 -3.233922 -0.417474
H  1.350148 -2.483331 -0.361983
H  -3.458087 1.855968 1.102157
H  -3.918968 1.493841 -0.581936
H  -4.185204 0.276898 0.697179
