program: Gaussian 09
title: 000222955
version: EM64L-G09RevD.01
frameworkgroup: C1[X(C8H8N2O5)]
method: RPBEPBE
basis: SDD
operation: Freq
keyword: #pfreq=noraman
keyword: PBEPBE/SDD
title: #p freq=noraman PBEPBE/SDD
converged: NO YES NO NO
title: Mulliken charges:
elementType: O O O O O N N C C C C C C C C H H H H H H H H
charge: -0.358536 -0.197475 -0.196686 -0.163727 -0.259532 0.018938 0.029804 0.424950 -0.452901 0.260743 -0.462127 -0.561381 0.348157 0.081286 -0.716608 0.256107 0.256109 0.294882 0.336598 0.221506 0.239350 0.221482 0.379060
chargesum: 0.00000
title: Mulliken charges with hydrogens summed into heavy atoms:
elementType: O O O O O N N C C C C C C C C
charge: 0.020524 -0.197475 -0.196686 -0.163727 -0.259532 0.018938 0.029804 0.424950 0.059315 0.260743 -0.167245 -0.224782 0.348157 0.081286 -0.034270
polarizability: 1.96360751e+02 7.60600025e-01 1.53280518e+02 1.19657768e-02 -6.90507408e-03 5.47955754e+01
1716.lowfreq: -7.1458 -0.0007 0.0004 0.0006 7.8266 7.9022 11.2167 53.4858 91.8126
frequency: 7.9000 53.4759 91.8081 129.5907 145.2170 168.8820 204.6376 214.7281 283.3247 296.3561 327.4036 335.9355 347.3779 378.5129 411.7809 442.7989 492.0260 567.4066 582.5144 619.9362 651.2683 659.7339 696.2515 712.3427 713.9075 757.1320 777.0437 807.8024 852.7647 896.0090 960.0850 965.2880 1034.7311 1064.4622 1077.8730 1089.7360 1145.7415 1166.3111 1198.7312 1234.7957 1251.6890 1258.3409 1283.7980 1327.3004 1357.6961 1380.2522 1399.7220 1400.2172 1431.0138 1467.8545 1485.3413 1490.0654 1490.7179 1554.5037 1633.1925 2981.8970 2984.0665 2999.8580 3034.5422 3078.5232 3087.7337 3183.1395 3195.2786
redmass: 9.2838 7.1722 9.2173 4.0562 2.9155 8.2299 4.3570 2.6976 6.6011 1.3950 8.8416 4.7550 8.2674 7.0729 6.2856 3.1652 6.6511 4.1510 7.4832 4.7775 6.1218 7.4740 4.7075 6.6371 5.9807 12.3898 1.5094 6.2982 1.0822 1.3624 2.6702 1.3744 2.2562 2.4211 1.5885 6.8229 2.2922 4.9199 13.3001 1.3178 3.3719 1.1364 1.9954 2.3150 8.3509 4.3098 2.2104 1.3023 1.5852 3.5850 1.1293 1.0409 2.9104 5.1571 6.7483 1.0655 1.0372 1.0629 1.0964 1.1003 1.0983 1.0913 1.0911
irintensity: 0.0061 0.0407 0.2199 3.9336 1.1095 2.2655 2.4643 2.3799 3.3369 0.6906 6.1318 1.0850 6.7258 1.8418 2.0066 4.2078 2.4403 0.4558 7.7047 6.8851 11.5002 14.4859 3.9322 0.0467 6.1731 17.0711 1.8162 0.3292 160.4538 3.4540 35.7477 29.4169 27.3708 2.3992 0.1480 66.6800 125.7814 286.9297 222.8040 57.6482 11.4245 0.0039 168.0778 57.3167 203.4259 1.3184 18.2227 28.1064 72.2483 13.1934 5.6881 13.9612 27.0330 131.2137 254.6200 240.5453 16.7175 14.2560 0.1406 33.4666 25.3840 21.2574 0.3661
temp: 298.150 k
press: 1.00000 atm
elementType: 8 8 8 8 8 7 7 6 6 6 6 6 6 6 6 1 1 1 1 1 1 1 1
symmnumber: 1
zpe: 420609.2 jmol-1
zpe.correction: 0.160202 hartree
zpe.thermalcorrener: 0.173545 hartree
zpe.thermalcorrenthalpy: 0.174489 hartree
zpe.thermalcorrgfe: 0.118237 hartree
zpe.sumelectzpe: -794.010493 hartree
zpe.sumelectthermal: -793.997150 hartree
zpe.sumelectthermalent: -793.996205 hartree
zpe.sumelectthermalfe: -794.052458 hartree
dipole: -1.6827 4.2584 -0.0006
dipole: 4.5788
quadrupole: -100.0277 -97.2710 -84.4423
quadrupole: -7.9991 -0.0061 -0.0005
quadrupole: -6.1140 -3.3573 9.4714 -7.9991 -0.0061 -0.0005
hfenergy: -794.1706943 hartree
pointgroup: C01 [X(C8H8N2O5)]
dipole: -0.5631675 -1.7111059 -0.008911 debye
dipolederiv: -0.9794777 0.4876698 0.0122004 0.4299944 -0.7923618 -0.0092943 0.0117163 -0.0100587 -0.3595825 -0.4371106 -0.0261268 0.0025849 0.1268143 -0.9392713 -0.0077739 0.0038826 -0.0061657 -0.2256124 -0.9201976 -0.0125825 0.0090244 0.0133575 -0.485358 -0.0026944 0.0094316 -0.0022998 -0.2041815 -0.5480252 -0.1592828 0.0028499 -0.4113075 -0.8024686 -0.0008073 0.0005474 -0.0037186 -0.1959624 -0.8871919 0.1490878 0.0090898 0.2742931 -0.5893154 -0.006511 0.0104395 -0.0049825 -0.2665309 1.4852108 -0.271692 -0.0193043 -0.5381294 1.4686349 0.0180575 -0.0215982 0.0148527 0.178689 1.9162154 0.267601 -0.0186699 0.4205529 1.160893 0.0040371 -0.0173102 0.0057639 0.2103887 0.6278137 0.169997 -0.0060398 -0.0127245 0.4408567 0.0040764 -0.0078781 0.0016693 0.0144253 -0.2568346 -0.1274456 0.0030213 0.1516905 0.2013455 -0.0006273 0.0061112 0.0030926 0.0770512 -0.8530039 0.1311936 0.0120439 0.0602654 -0.5030307 -0.0055213 0.0112991 -0.0063422 0.0163289 -0.7660991 0.2588097 0.0101385 0.0874534 0.0275669 0.0004987 0.0085336 -0.0016046 -0.1406625 0.7440783 -0.0774236 -0.0102876 -0.2643906 -0.1429918 0.0022186 -0.0122918 0.0000409 -0.0345221 -1.0464353 -0.2791569 0.0105448 0.0673866 -0.4946915 -0.0056152 0.0136804 -0.0013635 0.0154061 1.048579 -0.5205919 -0.0161041 -0.1914227 0.82268 0.0087136 -0.0130323 0.0128991 0.1387443 0.0205083 -0.0572667 0.0003437 -0.0408496 -0.0750253 -0.0011418 0.0003925 -0.0010248 0.0932451 0.0637888 0.0024801 0.0460035 -0.0499605 -0.004077 -0.0652917 0.0387687 -0.0735733 0.0035259 0.0616933 0.005285 -0.0473635 -0.0474745 -0.0068348 0.066309 -0.0413403 0.0731445 0.0085409 0.1252952 0.0188902 0.0004568 -0.0125026 0.0030632 -0.0011808 0.000169 -0.0015758 0.1460912 0.1542536 -0.0228953 0.0000603 -0.0110766 0.1470815 -0.0001541 0.0002486 -0.000019 0.1779953 0.0675118 0.0819016 0.1021879 0.0159575 0.0244768 -0.0530387 0.0727546 -0.0693624 -0.0704823 -0.1544646 -0.1086319 0.002188 -0.0528869 0.0635748 0.0002004 0.0027331 0.0008838 0.1092106 0.0631535 0.0856782 -0.1038098 0.0187989 0.0220549 0.0543868 -0.0756901 0.0691 -0.0636938 0.470739 0.0045018 -0.0011591 -0.0338393 0.453198 0.0011539 -0.0015675 0.0006444 0.3715878 unknown
polarizability: 196.2810273|1.7681591|153.3302619|-1.7408555|0.896608|54.8255548 unknown
InChI: InChI=1S/C8H8N2O5/c1-2-5-3-8(11)7(10(14)15)4-6(5)9(12)13/h3-4,11H,2H2,1H3
charge 0 multiplicity 1
23 atoms
O  2.135857 -2.218821 -0.063367
O  -1.534296 2.954169 0.029545
O  -3.197623 1.405032 0.03734
O  3.072142 1.897895 -0.036265
O  3.793265 -0.264669 -0.066036
N  -1.947059 1.729893 0.02369
N  2.83015 0.641523 -0.0451
C  -1.265101 -0.755784 -0.007727
C  -2.691207 -1.292415 0.004895
C  -0.925095 0.649611 0.001116
C  -0.184799 -1.658406 -0.029433
C  0.405884 1.092222 -0.011101
C  1.455069 0.156873 -0.032656
C  1.171627 -1.251782 -0.042354
C  -2.834326 -2.825392 -0.008615
H  -3.215129 -0.872406 0.884339
H  -3.237349 -0.854818 -0.852133
H  -0.366271 -2.734373 -0.037293
H  0.623855 2.163477 -0.003866
H  -2.392688 -3.2792 -0.914784
H  -3.906364 -3.088453 0.001966
H  -2.370653 -3.296957 0.877252
H  3.04451 -1.745818 -0.070114
