program: Gaussian 09
title: 000222951
version: EM64L-G09RevD.01
frameworkgroup: C1[X(C6H2O3S)]
method: RPBEPBE
basis: SDD
operation: Freq
keyword: #pfreq=noraman
keyword: PBEPBE/SDD
title: #p freq=noraman PBEPBE/SDD
converged: NO NO NO NO
title: Mulliken charges:
elementType: S O O O C C C C C C H H
charge: 0.383189 -0.236763 -0.147685 -0.156103 0.374479 -0.482091 -0.204515 0.146324 0.244356 -0.488958 0.285747 0.282019
chargesum: 0.00000
title: Mulliken charges with hydrogens summed into heavy atoms:
elementType: S O O O C C C C C C
charge: 0.383189 -0.236763 -0.147685 -0.156103 0.374479 -0.482091 0.081232 0.146324 0.244356 -0.206938
polarizability: 1.10550229e+02 1.96700006e+00 1.11310551e+02 -3.74312766e-03 -5.67691547e-03 3.31984830e+01
1716.lowfreq: -9.2390 -5.9342 -0.0008 -0.0002 0.0010 9.6207 129.5719 155.7209 201.3851
frequency: 129.5566 155.7178 201.3778 233.3174 322.9304 440.0799 457.9246 535.5996 556.8705 586.6875 646.3082 667.3441 681.6447 718.3626 738.4961 764.1886 773.9517 913.2286 930.0232 1017.5808 1098.7533 1207.0051 1234.5002 1382.8165 1472.5604 1526.7251 1696.1399 1746.5411 3201.8060 3239.0149
redmass: 8.5862 12.2871 8.8871 10.8092 13.3855 5.8887 16.2762 9.7082 5.2526 13.7487 11.1731 9.5361 11.3282 2.3012 12.9453 6.3417 2.0025 1.3404 6.5710 5.3438 1.2268 3.4329 2.2456 4.9997 6.6482 9.2927 13.0952 12.9692 1.0927 1.1009
irintensity: 0.5363 1.4102 0.1866 1.3840 4.6704 1.3839 5.7994 7.2742 0.2670 8.3397 21.0443 32.9227 24.3835 49.3401 127.2731 7.5987 42.4872 3.3138 47.6808 82.1031 0.7043 6.9457 91.7781 27.2251 5.9017 18.5609 527.6549 191.2415 2.1841 0.5455
temp: 298.150 k
press: 1.00000 atm
elementType: 16 8 8 8 6 6 6 6 6 6 1 1
symmnumber: 1
zpe: 175115.7 jmol-1
zpe.correction: 0.066698 hartree
zpe.thermalcorrener: 0.074360 hartree
zpe.thermalcorrenthalpy: 0.075304 hartree
zpe.thermalcorrgfe: 0.033779 hartree
zpe.sumelectzpe: -852.860458 hartree
zpe.sumelectthermal: -852.852796 hartree
zpe.sumelectthermalent: -852.851852 hartree
zpe.sumelectthermalfe: -852.893378 hartree
dipole: 5.9901 -2.4509 0.0014
dipole: 6.4721
quadrupole: -66.2962 -69.1434 -62.9015
quadrupole: -3.9891 -0.0033 0.0012
quadrupole: -0.1825 -3.0297 3.2122 -3.9891 -0.0033 0.0012
hfenergy: -852.9271564 hartree
pointgroup: C01 [X(C6H2O3S1)]
dipole: 2.5362965 -0.2258822 0.0005396 debye
dipolederiv: -0.0179443 -0.0913321 0.0000246 -0.1079913 -0.0798723 0.0000402 0.0000503 0.0000389 0.2364134 -0.7315058 0.0050614 0.0001439 -0.0571167 -1.2601149 0.0000875 -0.0001491 0.0000783 -0.2338161 -0.5570903 -0.2895111 0.000101 -0.2839665 -1.0456409 0.0002253 -0.0000744 -0.0002204 -0.3005291 -0.6088271 0.2856136 0.0000586 0.3319584 -1.0028729 -0.0001068 -0.00013 0.0002972 -0.2974999 -0.2374656 -0.2973827 -0.0000139 -0.4722418 -0.2533704 0.0000823 0.0001796 -0.0000211 0.0185793 -0.3411954 0.4994954 -0.0001184 0.6517133 -0.0350898 -0.0000842 0.0000561 0.0000171 -0.1703824 -0.2738685 -0.014018 0.0000282 -0.1665588 -0.0274399 0.0000189 0.000041 0.000048 -0.0818971 1.1834295 0.1767419 -0.0001139 0.2688919 1.6960081 -0.0002836 -0.0000044 -0.0001051 0.3428288 1.4423721 -0.1828004 -0.0001044 -0.3879075 1.6442183 0.0000813 0.0000591 -0.0000929 0.3528511 -0.0122401 -0.0881599 -0.0000241 0.1542419 0.2487547 -0.0000809 -0.0000423 -0.0000581 -0.2801626 0.116538 -0.0112434 0.0000025 0.0408537 0.0318722 0.00001 -0.000004 0.0000154 0.1981756 0.0377976 0.0075353 0.0000157 0.0281234 0.0835479 0.0000101 0.0000181 0.0000028 0.215439 unknown
polarizability: 109.5072674|1.4100828|112.3535126|-0.0019013|-0.0065287|33.198483 unknown
InChI: InChI=1S/C6H2O3S/c7-5-3-1-2-10-4(3)6(8)9-5/h1-2H
charge 0 multiplicity 1
12 atoms
S  1.925833 1.460503 -0.000218
O  -1.898685 -0.015843 -0.000146
O  -1.471668 -2.339809 0.000012
O  -1.573794 2.329077 -0.00031
C  0.369708 -0.671067 0.000215
C  0.315472 0.718817 0.000111
C  1.695185 -1.210264 0.000065
C  -1.019223 -1.191778 0.000427
C  -1.076949 1.198229 0.000223
C  2.646358 -0.194397 -0.000058
H  1.940445 -2.273243 0.000117
H  3.731614 -0.286625 -0.000139
