program: Gaussian 09
title: 000222976
version: EM64L-G09RevD.01
frameworkgroup: C1[X(C14H16O6)]
method: RPBEPBE
basis: SDD
operation: Freq
keyword: #pfreq=noraman
keyword: PBEPBE/SDD
title: #p freq=noraman PBEPBE/SDD
converged: YES YES NO NO
title: Mulliken charges:
elementType: O O O O O O C C C C C C C C C C C C C C H H H H H H H H H H H H H H H H
charge: -0.291755 -0.266554 -0.269817 -0.266376 -0.389503 -0.253280 0.512771 0.222189 -0.536167 0.197562 -0.379055 -0.351993 -0.348291 0.117642 0.192382 -0.258041 0.077965 -0.535616 -0.667008 -0.496660 0.246757 0.298612 0.256137 0.257684 0.233677 0.222685 0.229432 0.226936 0.244810 0.215308 0.229733 0.250202 0.247676 0.223719 0.229860 0.376377
chargesum: 0.00000
title: Mulliken charges with hydrogens summed into heavy atoms:
elementType: O O O O O O C C C C C C C C C C C C C C
charge: -0.291755 -0.266554 -0.269817 -0.266376 -0.013126 -0.253280 0.512771 0.222189 -0.289410 0.197562 -0.080444 -0.094309 -0.092155 0.117642 0.192382 0.198321 0.077965 0.165561 0.028235 0.204596
polarizability: 3.57817356e+02 2.73518002e+00 1.77374968e+02 8.03738007e+00 8.22766316e+00 1.02605352e+02
1716.lowfreq: -7.9759 -2.0178 -0.0007 -0.0004 0.0004 4.4280 17.1923 24.8054 35.3265
frequency: 17.1248 24.7250 35.2995 44.0596 56.5347 71.8719 81.2273 93.2175 110.0055 140.8728 147.9068 159.9637 178.6412 196.4894 202.1429 219.6850 227.6358 256.8947 294.4517 310.7760 325.7031 345.9426 364.2480 395.4603 430.8973 456.3176 467.5797 491.0513 534.7037 553.6326 582.1754 595.1689 620.7093 660.1265 711.1742 714.8043 730.8306 736.6035 751.2958 771.5795 814.8046 835.1694 840.8414 856.8566 921.8945 963.0663 972.1061 980.8609 990.6948 1000.6579 1025.0817 1078.7651 1095.3016 1108.3086 1112.1684 1120.4693 1153.4898 1156.1433 1157.5241 1178.8586 1188.6411 1246.8099 1268.9722 1274.7739 1278.4320 1300.5028 1354.5515 1364.4399 1389.7795 1407.1203 1416.3731 1437.0847 1447.8175 1455.1073 1456.3990 1462.8844 1463.5426 1467.7818 1474.0736 1485.8215 1503.8076 1559.1272 1583.9253 1606.3893 1626.7083 1636.2478 2962.8661 2992.6945 2998.5839 3029.8418 3052.5793 3078.4644 3087.8752 3093.7231 3108.5893 3119.5497 3125.7523 3132.1072 3147.8081 3161.8822 3189.9223 3503.4796
redmass: 4.9982 4.3984 3.8277 4.2429 3.1227 5.3076 4.7038 3.5510 5.8582 2.1575 4.0067 3.9024 1.9935 3.9625 3.3250 1.7006 2.0980 1.6704 2.5714 3.1042 3.8486 4.2117 4.9109 5.0616 4.7000 4.0366 3.9250 3.0764 5.6633 6.5555 2.1353 2.8704 3.5294 4.8196 4.9540 6.2683 3.9384 3.8803 4.0252 5.3655 1.4131 3.5371 1.5422 1.5591 4.5020 6.1077 1.4163 1.6004 3.6762 3.9711 4.0922 2.5743 2.1453 1.2622 1.2578 2.1707 1.4933 1.4881 1.6214 1.5228 4.6464 1.9909 1.8613 2.3080 1.1342 2.6430 1.3330 3.0211 1.2347 2.3420 2.0980 1.2116 1.4659 1.1039 1.0564 1.0434 1.0514 1.0502 1.0938 1.0517 2.6187 6.8687 8.0672 6.7535 8.3754 7.9071 1.0327 1.0362 1.0300 1.0593 1.1043 1.0869 1.0972 1.1034 1.1026 1.1059 1.0997 1.1058 1.0902 1.0898 1.0959 1.0638
irintensity: 2.4516 0.0885 4.4568 1.1710 0.6219 1.8273 6.3004 7.9069 0.9721 1.1077 0.4355 5.6267 2.4098 0.6648 0.9876 0.8869 0.3700 0.8126 1.0505 1.4512 26.0273 9.6862 3.4483 6.2205 20.2221 5.7057 5.3744 10.1510 22.8566 35.5582 67.3965 50.8632 6.8287 18.8691 3.6173 24.4470 8.0830 3.2285 12.1919 17.6582 0.3000 17.1446 15.8190 43.9488 11.5982 59.4055 19.2633 1.8938 45.3477 40.4977 180.3823 496.9015 59.1489 1.6432 0.0839 144.5804 164.2323 44.8092 13.8450 19.0432 754.5575 214.8565 38.6278 125.2469 2.4662 51.8395 1.3867 13.2906 25.7483 11.6386 123.6411 7.6648 12.4743 32.1383 18.4366 13.5016 38.3753 16.0964 87.5062 15.2646 264.8582 156.4536 474.1603 36.1595 218.0974 137.3558 49.7118 26.9300 93.7445 39.4779 41.0051 0.4088 43.5607 0.3224 36.4276 34.0766 24.0307 22.3566 5.6230 3.5550 11.7470 30.6929
temp: 298.150 k
press: 1.00000 atm
elementType: 8 8 8 8 8 8 6 6 6 6 6 6 6 6 6 6 6 6 6 6 1 1 1 1 1 1 1 1 1 1 1 1 1 1 1 1
symmnumber: 1
zpe: 726225.5 jmol-1
zpe.correction: 0.276605 hartree
zpe.thermalcorrener: 0.297779 hartree
zpe.thermalcorrenthalpy: 0.298723 hartree
zpe.thermalcorrgfe: 0.223683 hartree
zpe.sumelectzpe: -992.901016 hartree
zpe.sumelectthermal: -992.879842 hartree
zpe.sumelectthermalent: -992.878898 hartree
zpe.sumelectthermalfe: -992.953938 hartree
dipole: -1.9596 2.0502 1.5286
dipole: 3.2218
quadrupole: -85.1205 -109.6892 -120.5991
quadrupole: -11.8054 -4.8909 -5.6672
quadrupole: 20.0158 -4.5529 -15.4629 -11.8054 -4.8909 -5.6672
hfenergy: -993.1776207 hartree
pointgroup: C01 [X(C14H16O6)]
dipole: -0.7807117 -0.6191968 0.7834384 debye
polarizability: 355.2183475|-26.1322201|107.0837533|-7.1896407|-13.9226184|175.4955751 unknown
InChI: InChI=1S/C14H16O6/c1-4-20-14(17)10(13(15)16)7-9-5-6-11(18-2)12(8-9)19-3/h5-8,15H,4H2,1-3H3
charge 0 multiplicity 1
36 atoms
O  -4.040694 -0.116144 1.491884
O  -4.76095 0.713638 -1.206029
O  4.258805 -0.543953 -0.523564
O  3.134703 -0.907632 1.492052
O  2.506359 -1.654707 -2.504247
O  1.705639 0.490872 -2.839711
C  -0.673765 0.019334 -0.250048
C  -3.038438 0.032029 0.513963
C  -1.667894 -0.16978 0.760584
C  -3.459308 0.441653 -0.795189
C  -1.104262 0.470785 -1.533086
C  -2.469409 0.670466 -1.783603
C  0.706311 -0.24112 0.147805
C  1.880205 -0.424445 -0.555277
C  3.108927 -0.668502 0.256298
C  5.564102 -0.744116 0.174783
C  2.01284 -0.429103 -2.042896
C  -3.618589 -0.502315 2.840768
C  6.047965 0.564691 0.805749
C  -5.934294 0.113406 -0.538097
H  -1.339255 -0.487475 1.755636
H  -0.375279 0.694937 -2.313838
H  0.853119 -0.35943 1.233549
H  -2.81694 1.018442 -2.761081
H  5.437686 -1.534756 0.935008
H  6.234875 -1.090269 -0.627849
H  -2.935454 0.251283 3.277845
H  -3.128743 -1.495294 2.841294
H  -4.546848 -0.546719 3.429047
H  7.057242 0.420422 1.23452
H  6.104619 1.367444 0.050519
H  5.371021 0.882435 1.616191
H  -6.100484 0.56387 0.452005
H  -5.809211 -0.97824 -0.430385
H  -6.771021 0.3369 -1.217657
H  2.623318 -1.599506 -3.492242
