program: Gaussian 09
title: 000222966
version: EM64L-G09RevD.01
frameworkgroup: C1[X(C12H12N2O2)]
method: RPBEPBE
basis: SDD
operation: Freq
keyword: #p
keyword: freq=noraman
keyword: PBEPBE/SDD
title: #p freq=noraman PBEPBE/SDD
converged: YES YES NO NO
title: Mulliken charges:
elementType: O O N N C C C C C C C C C C C C H H H H H H H H H H H H
charge: -0.288781 -0.277887 0.002797 -0.009139 -0.263906 0.541328 -0.542360 -0.415665 -0.450161 0.225638 0.215374 -0.333936 -0.207006 -0.127349 -0.520238 -0.536245 0.281182 0.264513 0.245150 0.272690 0.271405 0.242993 0.257358 0.218719 0.232678 0.230093 0.223340 0.247415
chargesum: 0.00000
title: Mulliken charges with hydrogens summed into heavy atoms:
elementType: O O N N C C C C C C C C C C C C
charge: -0.288781 -0.277887 0.002797 -0.009139 0.017276 0.541328 -0.277847 -0.170515 0.093934 0.225638 0.215374 -0.090943 -0.207006 -0.127349 0.188517 0.164604
polarizability: 1.85272322e+02 1.46883446e+01 1.55752908e+02 6.55991078e+00 -1.02687349e+01 9.23211283e+01
1716.lowfreq: -8.0885 -3.8081 -0.0011 -0.0010 -0.0008 4.4639 19.5317 40.9451 71.6867
frequency: 19.3677 40.9420 71.6812 77.1316 96.5082 114.7186 125.4904 135.0540 158.4278 193.6888 199.9685 235.0061 262.7356 273.0834 312.0727 341.5252 368.7332 371.7531 407.8358 455.8551 481.7879 496.4757 536.0286 586.6600 594.7845 644.4287 713.1027 714.5893 735.7640 804.7251 846.0033 892.4562 923.2456 929.0417 946.5335 955.0092 983.5469 1002.7259 1022.4590 1110.8205 1111.6198 1114.4763 1145.6060 1157.4185 1171.9877 1181.1822 1210.0991 1255.4506 1257.4329 1280.0007 1280.6299 1319.7834 1384.3668 1407.1601 1432.9084 1440.5305 1443.6882 1458.5327 1467.8045 1472.7234 1480.9727 1498.5791 1582.2390 1614.1292 2194.9250 2205.3500 2965.6888 2981.0061 3005.5539 3011.5488 3056.8832 3070.9281 3089.8141 3128.5059 3131.8611 3134.9005 3150.1604 3167.5955
redmass: 5.8646 6.5769 3.2091 3.0605 6.2988 6.0108 3.7727 2.4653 1.9399 2.6360 4.2294 1.5461 2.2936 5.7208 4.2404 4.2220 3.6836 5.3301 6.2235 4.5289 3.8511 10.9907 5.4143 4.8556 6.1165 3.8528 5.5150 3.9770 3.4772 1.4599 4.9124 1.5469 3.4800 1.4050 2.8409 6.0018 8.6959 3.7938 3.1709 1.2572 1.2736 2.2634 1.4834 1.3933 1.4501 1.1697 1.9698 2.5731 1.3606 1.6791 1.3404 1.4833 6.4946 1.9765 1.2294 1.0983 1.4133 1.0697 1.0508 1.0944 1.0533 2.6049 7.3270 6.5128 12.5721 12.4571 1.0326 1.0337 1.0637 1.0786 1.1043 1.1019 1.0987 1.0998 1.1045 1.0894 1.0921 1.0940
irintensity: 0.4556 3.0946 7.3099 6.3601 4.9817 16.6912 0.8838 1.5007 0.7623 4.4296 1.6502 0.9393 3.9774 1.8813 3.5888 3.4990 0.4870 4.8915 0.6277 6.0432 2.5077 0.4689 7.6669 4.4040 4.4272 18.0908 8.9555 3.9081 4.5886 40.7845 2.1032 19.3899 4.9139 2.2884 23.4306 26.2103 42.9888 28.8599 0.0373 0.2585 20.8646 73.3385 4.7337 10.8461 3.3618 0.8464 46.6638 197.8016 17.5905 52.5405 2.5418 6.5437 14.6498 17.7653 0.3134 23.0600 16.6870 14.4803 16.0456 69.9816 23.1648 129.2051 21.6610 20.2980 7.3284 6.2260 61.4723 74.1615 6.7302 3.1005 41.2753 6.2506 34.1703 21.5331 16.5150 3.4912 2.8904 8.2488
temp: 298.150 k
press: 1.00000 atm
elementType: 8 8 7 7 6 6 6 6 6 6 6 6 6 6 6 6 1 1 1 1 1 1 1 1 1 1 1 1
symmnumber: 1
zpe: 560126.3 jmol-1
zpe.correction: 0.213341 hartree
zpe.thermalcorrener: 0.229744 hartree
zpe.thermalcorrenthalpy: 0.230688 hartree
zpe.thermalcorrgfe: 0.167991 hartree
zpe.sumelectzpe: -723.194744 hartree
zpe.sumelectthermal: -723.178341 hartree
zpe.sumelectthermalent: -723.177397 hartree
zpe.sumelectthermalfe: -723.240095 hartree
dipole: 3.0270 -1.5428 2.4518
dipole: 4.1898
quadrupole: -83.7530 -106.1294 -95.6257
quadrupole: -10.2122 3.4905 -10.9011
quadrupole: 11.4164 -10.9601 -0.4563 -10.2122 3.4905 -10.9011
hfenergy: -723.4080853 hartree
pointgroup: C01 [X(C12H12N2O2)]
dipole: -1.1835955 0.2796097 1.1126924 debye
polarizability: 183.4804159|18.162525|147.9977029|-5.3659759|24.2237762|101.8682395 unknown
InChI: InChI=1S/C12H12N2O2/c1-15-11-4-3-9(7-12(11)16-2)10(8-14)5-6-13/h3-4,7,10H,5H2,1-2H3
charge 0 multiplicity 1
28 atoms
O  -2.137708 -1.313948 -1.507249
O  -3.31905 0.378386 0.45619
N  3.549725 2.73266 -0.287587
N  2.372441 -3.164896 0.26958
C  2.388006 0.332918 -0.450443
C  0.877042 0.394937 -0.194904
C  0.016905 -0.467369 -0.913291
C  0.328571 1.252251 0.785011
C  3.131226 -0.628079 0.558301
C  -1.373146 -0.484455 -0.676583
C  -1.924499 0.400107 0.304875
C  -1.060665 1.25295 1.032362
C  3.024513 1.664516 -0.366065
C  2.707293 -2.027963 0.403325
C  -3.119114 -2.22449 -0.876917
C  -3.916947 1.332909 1.395732
H  2.564739 -0.05247 -1.473143
H  0.400774 -1.154334 -1.675236
H  0.973588 1.940956 1.342559
H  2.924751 -0.297375 1.592271
H  4.223961 -0.565794 0.397753
H  -1.467687 1.93814 1.78128
H  -3.899039 -1.65752 -0.344341
H  -2.605618 -2.916073 -0.181993
H  -3.551473 -2.790772 -1.715366
H  -3.684084 2.375501 1.106835
H  -3.576329 1.145489 2.432297
H  -5.000776 1.161121 1.324444
