program: Gaussian 09
title: 000222970
version: EM64L-G09RevD.01
frameworkgroup: C1[X(C13H14O6)]
method: RPBEPBE
basis: SDD
operation: Freq
keyword: #pfreq=noraman
keyword: PBEPBE/SDD
title: #p freq=noraman PBEPBE/SDD
converged: YES YES NO NO
title: Mulliken charges:
elementType: O O O O O O C C C C C C C C C C C C C H H H H H H H H H H H H H H
charge: -0.283361 -0.415026 -0.415112 -0.286044 -0.234531 -0.241398 -0.194375 -0.337574 -0.573278 0.302020 0.189943 0.000957 -0.447553 0.155616 0.172690 0.236590 -0.345245 -0.514802 -0.535780 0.297430 0.302038 0.246339 0.253796 0.276029 0.240431 0.376807 0.382176 0.210270 0.260557 0.228415 0.221901 0.227989 0.242087
chargesum: 0.00000
title: Mulliken charges with hydrogens summed into heavy atoms:
elementType: O O O O O O C C C C C C C C C C C C C
charge: -0.283361 -0.038220 -0.032936 -0.286044 -0.234531 -0.241398 0.103055 -0.035536 -0.073143 0.302020 0.189943 0.000957 -0.171524 0.155616 0.172690 0.236590 -0.104814 0.184439 0.156197
polarizability: 2.13181734e+02 3.45932655e+00 1.69638817e+02 2.62912268e-01 -8.99576012e+00 9.88536441e+01
1716.lowfreq: -9.1970 -4.2660 -0.0009 -0.0002 -0.0001 2.1253 23.1023 35.3484 40.2424
frequency: 23.0684 35.3190 40.0613 45.8077 62.6900 84.2470 104.5583 112.4319 126.0097 156.7419 195.6916 203.8720 227.8216 231.7691 249.9883 273.5371 319.5595 332.8537 358.1312 369.7187 412.4460 433.9150 473.4524 529.1001 539.4325 574.8061 580.5131 595.0606 604.3635 624.5044 647.6816 669.3966 696.7111 709.1252 742.1866 774.8996 807.0027 860.3925 867.2629 899.9552 923.7586 939.5938 971.1334 1006.5547 1018.5413 1045.5007 1050.7901 1080.9603 1109.3004 1111.5032 1112.3138 1143.2748 1149.8601 1154.8676 1179.4722 1187.4709 1196.8436 1232.6726 1242.0515 1257.5368 1268.3740 1276.8771 1294.9124 1306.0470 1374.3194 1380.1813 1423.3175 1435.6473 1449.8772 1453.4766 1464.8884 1466.1144 1470.3289 1479.0441 1482.4569 1591.7495 1616.7296 1656.1897 1659.4205 2948.3941 2962.6327 2976.8782 2991.4105 3052.1242 3058.6959 3082.6027 3087.5063 3123.2462 3128.9475 3154.2416 3173.9739 3508.0839 3509.8188
redmass: 9.2389 4.9235 1.9882 9.8681 3.8732 3.4476 4.8897 3.1213 4.5514 2.3507 3.3306 3.0124 2.5079 4.1809 1.6674 5.6527 3.9417 5.9252 4.5627 4.3404 5.8152 4.4247 5.7960 3.6003 4.6651 2.8276 3.7958 3.5861 1.4284 2.5874 3.3029 2.4097 5.2063 4.1116 4.3367 5.4000 1.5460 3.1352 5.1843 5.1390 6.4940 1.4078 2.2649 5.6539 3.5924 3.1622 3.4497 2.0762 1.2381 2.2288 1.2837 1.4529 1.3603 1.3700 1.3930 1.3830 3.2847 1.5633 1.9211 1.2525 3.7408 1.6036 1.5584 2.4278 1.9822 5.7567 1.3805 1.2736 1.4592 1.6877 1.3732 1.0615 1.2402 1.1262 1.3784 7.8725 8.3170 9.3683 8.6499 1.0798 1.0326 1.0349 1.0679 1.1041 1.0847 1.0946 1.0964 1.0998 1.1051 1.0873 1.0960 1.0639 1.0639
irintensity: 2.0319 1.1609 4.4158 1.4702 1.0822 1.4320 2.5148 3.4080 6.1497 6.5525 1.1998 2.7072 0.5133 2.0196 0.5373 3.2379 6.4054 2.2803 1.6524 0.2626 2.6971 6.7034 9.5209 4.0321 69.7729 33.8747 30.2221 13.0292 97.2497 51.5535 40.4191 77.2252 13.0788 28.2504 1.8512 1.5012 51.4675 4.2251 12.7481 4.3915 33.8426 5.3402 22.3936 61.7241 13.0212 448.7157 17.8924 82.9364 7.0784 117.2871 5.4025 1.7392 0.9247 6.9431 6.0021 2.9673 74.8493 43.9860 79.9810 14.1618 93.2978 15.5446 33.0402 16.0621 58.3449 26.6482 3.8891 18.4568 34.9204 42.0144 78.5235 17.1456 81.3155 38.8682 13.8622 11.3919 21.4512 215.8167 182.2101 5.2127 69.2708 80.4843 16.5847 44.0191 0.7092 10.4476 40.2821 23.2104 14.8632 5.9910 6.8213 25.4101 25.9411
temp: 298.150 k
press: 1.00000 atm
elementType: 8 8 8 8 8 8 6 6 6 6 6 6 6 6 6 6 6 6 6 1 1 1 1 1 1 1 1 1 1 1 1 1 1
symmnumber: 1
zpe: 658057.3 jmol-1
zpe.correction: 0.250641 hartree
zpe.thermalcorrener: 0.269428 hartree
zpe.thermalcorrenthalpy: 0.270372 hartree
zpe.thermalcorrgfe: 0.201462 hartree
zpe.sumelectzpe: -953.706726 hartree
zpe.sumelectthermal: -953.687939 hartree
zpe.sumelectthermalent: -953.686995 hartree
zpe.sumelectthermalfe: -953.755905 hartree
dipole: 2.3199 -0.3783 2.4130
dipole: 3.3687
quadrupole: -86.1445 -107.6190 -112.2526
quadrupole: 9.3087 -4.7073 -0.3736
quadrupole: 15.8608 -5.6136 -10.2472 9.3087 -4.7073 -0.3736
hfenergy: -953.957367 hartree
pointgroup: C01 [X(C13H14O6)]
dipole: 0.8677297 -0.1099184 -0.9957394 debye
polarizability: 212.8762509|-5.3359898|160.8402336|-4.4465943|-24.9450016|107.9577106 unknown
InChI: InChI=1S/C13H14O6/c1-18-9-4-3-6-7(11(9)19-2)5-8(12(14)15)10(6)13(16)17/h3-4,8,10,14,16H,5H2,1-2H3
charge 0 multiplicity 1
33 atoms
O  2.114441 1.991939 -0.61982
O  -3.825735 2.21976 -0.759288
O  -3.535849 -1.672912 -0.68732
O  3.961158 -0.119885 -0.052165
O  -3.782828 1.28835 1.36484
O  -2.202415 -3.041615 0.623419
C  -2.075456 0.633983 -0.304827
C  -1.720128 -0.622063 0.543232
C  -0.783584 1.529374 -0.275662
C  -0.196963 -0.722854 0.409751
C  0.318272 0.510763 -0.055527
C  1.701233 0.705982 -0.230202
C  0.661444 -1.792295 0.709084
C  -3.293702 1.367112 0.215565
C  -2.463025 -1.89909 0.187162
C  2.583486 -0.377504 0.087786
C  2.055372 -1.612059 0.538551
C  3.115602 2.113632 -1.701068
C  4.890592 -1.182579 0.338526
H  -2.270843 0.337652 -1.348898
H  -1.986993 -0.417487 1.604167
H  -0.811858 2.251715 0.563974
H  -0.662622 2.116739 -1.200019
H  0.26106 -2.747038 1.061141
H  2.72963 -2.440399 0.774907
H  -4.605146 2.707903 -0.377094
H  -4.009207 -2.533908 -0.850605
H  2.764559 1.593203 -2.613164
H  4.087671 1.702682 -1.386943
H  3.188974 3.195259 -1.892128
H  4.763117 -2.083873 -0.29191
H  4.762954 -1.452585 1.404419
H  5.893092 -0.7582 0.180321
