program: Gaussian 09
title: 000222953
version: EM64L-G09RevD.01
frameworkgroup: C1[X(C7H3BrClNO3)]
method: RPBEPBE
basis: SDD
operation: Freq
keyword: #p
keyword: freq=noraman
keyword: PBEPBE/SDD
title: #p freq=noraman PBEPBE/SDD
converged: YES YES NO NO
title: Mulliken charges:
elementType: Br Cl O O O N C C C C C C C H H H
charge: 0.154168 -0.082988 -0.155811 -0.178930 -0.066539 -0.001423 0.538641 0.533697 -0.553088 -0.323225 -0.311519 -0.209262 -0.168513 0.287398 0.279223 0.258170
chargesum: 0.00000
title: Mulliken charges with hydrogens summed into heavy atoms:
elementType: Br Cl O O O N C C C C C C C
charge: 0.154168 -0.082988 -0.155811 -0.178930 -0.066539 -0.001423 0.538641 0.533697 -0.553088 -0.035827 -0.032296 0.048908 -0.168513
polarizability: 1.62232790e+02 3.39560538e+00 1.45900655e+02 4.34395739e+00 -2.60125672e+00 5.68760308e+01
1716.lowfreq: -6.4491 -2.7590 0.0014 0.0019 0.0026 4.2624 32.1488 45.9540 52.3233
frequency: 32.0917 45.9516 52.3228 139.6113 153.7914 164.9816 193.1998 239.5970 264.2652 317.2359 372.8680 398.9628 425.9084 464.4780 518.8364 555.9701 639.5980 652.3438 678.4674 696.7279 729.8742 772.7954 824.8634 907.0387 943.2102 996.0302 1017.3838 1107.3525 1155.6139 1185.3340 1217.9457 1228.5440 1353.7472 1381.5852 1406.5998 1430.7483 1564.7842 1584.1373 1733.1950 3164.9052 3178.0411 3190.7606
redmass: 16.5439 15.6113 15.3298 12.8415 7.2770 23.0218 7.4110 11.5033 13.3788 7.8691 12.1371 8.1984 8.7090 6.1572 5.1670 7.2369 8.3655 8.5351 8.6984 8.4759 2.3766 10.1466 1.8282 9.0670 1.3983 1.3871 7.9730 2.0307 2.4065 1.5337 10.5048 1.9328 9.1007 6.8053 3.1442 2.5004 6.1787 6.6656 13.1323 1.0879 1.0926 1.0998
irintensity: 1.0565 3.5482 1.0615 1.7349 1.0784 0.7872 0.4542 3.3491 0.6966 0.7874 3.4377 11.4348 23.5603 10.3103 1.9574 4.2692 40.3646 120.5453 8.3905 3.8670 41.1683 12.1277 36.5406 170.9773 1.4144 0.5300 32.1126 1.1200 30.6965 45.9961 153.2021 47.2887 15.5464 83.6082 92.6038 29.4588 27.7449 28.8794 214.8577 2.3361 2.1016 1.2721
temp: 298.150 k
press: 1.00000 atm
elementType: 35 17 8 8 8 7 6 6 6 6 6 6 6 1 1 1
symmnumber: 1
zpe: 233760.5 jmol-1
zpe.correction: 0.089035 hartree
zpe.thermalcorrener: 0.100919 hartree
zpe.thermalcorrenthalpy: 0.101863 hartree
zpe.thermalcorrgfe: 0.048104 hartree
zpe.sumelectzpe: -1021.465828 hartree
zpe.sumelectthermal: -1021.453944 hartree
zpe.sumelectthermalent: -1021.453000 hartree
zpe.sumelectthermalfe: -1021.506759 hartree
dipole: 0.9404 4.1814 -0.2658
dipole: 4.2941
quadrupole: -110.2997 -76.5757 -92.4638
quadrupole: 3.8120 -0.1003 -0.2591
quadrupole: -17.1866 16.5374 0.6492 3.8120 -0.1003 -0.2591
hfenergy: -1021.5548628 hartree
pointgroup: C01 [X(C7H3Br1Cl1N1O3)]
dipole: -0.0981912 1.6663971 0.2600869 debye
dipolederiv: 0.123696 0.0128127 -0.0215524 0.0457958 -0.4860042 -0.0517768 -0.0119514 -0.0595457 0.0880915 -0.8199381 0.3108623 -0.268321 0.4029004 -0.40944 0.2264954 -0.2990937 0.1905102 -0.2907233 -0.494081 0.1379138 0.0539892 0.183211 -0.3642624 -0.2647286 -0.0335526 -0.1994669 -0.5095616 -0.7523827 -0.0476079 -0.2466413 0.0479064 -0.2848034 -0.1531187 -0.13597 -0.1459156 -0.4979715 -0.5648291 -0.1588866 0.0068089 -0.0762271 -0.827099 0.3629053 -0.1354842 0.2427057 -0.3436555 1.3747724 -0.1943988 0.2198846 -0.4838746 0.4545145 0.4785795 0.1558288 0.3538756 0.8653983 -0.3227459 -0.0130609 -0.037185 0.073179 -0.3528417 -0.1081574 -0.0196701 -0.0811024 0.0318004 -0.710306 -0.0017161 -0.0663856 -0.0385371 -0.4638425 0.0309816 -0.0908473 -0.0079854 0.033073 0.2522378 0.0504288 -0.0105738 -0.1309313 1.05487 0.082568 0.1251805 0.1171224 -0.1165422 0.0719764 -0.0476715 0.0083404 -0.1381851 0.1357841 0.0090366 -0.0873874 0.0668509 -0.0619962 0.111746 0.0137756 -0.0068088 0.2096877 0.0781249 0.0288712 -0.0438358 -0.0153184 -0.0871359 -0.3465487 0.038738 -0.0066853 0.022265 0.1448749 0.0443322 0.0048135 0.0474703 -0.114333 1.8910178 -0.1183909 0.3699377 -0.1366595 1.1757625 -0.6530282 0.5568027 -0.4580561 0.5353367 0.0462699 -0.0333365 -0.004626 -0.013413 0.0977874 0.0024084 0.008528 -0.0283935 0.1563871 0.0625992 0.0485478 0.0129654 0.039755 0.0900466 -0.0045462 -0.0011825 0.0054351 0.1522495 0.076516 0.0019901 -0.0031471 -0.0068726 -0.0434717 -0.0308222 0.0078215 -0.0281862 0.1595826 unknown
polarizability: 159.1807239|-7.2798456|146.3720405|12.5188805|9.946877|59.4567112 unknown
InChI: InChI=1S/C7H3BrClNO3/c8-6-4(7(9)11)2-1-3-5(6)10(12)13/h1-3H
charge 0 multiplicity 1
16 atoms
Br 0.053138 -2.418802 -0.287428
Cl -3.875023 0.668141 -0.85288
O  2.791785 -1.255219 -1.036408
O  3.482832 -0.044359 0.773615
O  -2.828686 -1.551375 0.329117
N  2.593029 -0.417073 -0.084176
C  1.253737 0.230238 0.026755
C  -1.187522 0.247692 -0.005538
C  0.037367 -0.492498 -0.078313
C  1.282024 1.624028 0.248778
C  -1.145839 1.658153 0.165057
C  0.074647 2.341781 0.307864
C  -2.515349 -0.430805 -0.051552
H  2.251187 2.117311 0.365483
H  -2.091861 2.20438 0.196858
H  0.084534 3.424009 0.461666
