program: Gaussian 09
title: 000222977
version: EM64L-G09RevD.01
frameworkgroup: C1[X(C14H17NO3)]
method: RPBEPBE
basis: SDD
operation: Freq
keyword: #p
keyword: freq=noraman
keyword: PBEPBE/SDD
title: #p freq=noraman PBEPBE/SDD
converged: YES YES NO NO
title: Mulliken charges:
elementType: O O O N C C C C C C C C C C C C C C H H H H H H H H H H H H H H H H H
charge: -0.281378 -0.269685 -0.247455 -0.398520 -0.219453 -0.077401 -0.494166 -0.538721 0.266215 0.272937 -0.386191 -0.392706 -0.252157 -0.241512 0.241494 0.303890 -0.779654 -0.760294 0.291448 0.298932 0.217014 0.260899 0.224509 0.241094 0.310472 0.251031 0.235117 0.230212 0.229355 0.254724 0.254710 0.211543 0.253603 0.247031 0.243062
chargesum: 0.00000
title: Mulliken charges with hydrogens summed into heavy atoms:
elementType: O O O N C C C C C C C C C C C C C C
charge: -0.281378 -0.269685 -0.247455 -0.088049 0.071995 0.221532 -0.016253 -0.073118 0.266215 0.272937 -0.135160 -0.157589 -0.021945 -0.012156 0.241494 0.303890 -0.058677 -0.016599
polarizability: 1.86374904e+02 1.21490749e+01 1.70340070e+02 8.11964035e+00 -1.05663637e+01 1.31469524e+02
1716.lowfreq: -6.6179 0.0003 0.0006 0.0008 7.3499 12.2394 28.6107 41.2786 49.9719
frequency: 28.3740 41.2704 49.9218 56.7858 67.6231 70.7470 77.2465 91.5406 158.3796 166.5633 198.7982 205.2251 244.5232 282.8985 300.3122 323.8420 376.1459 407.3577 454.7798 461.3454 503.7523 508.1423 531.8665 546.4742 572.6496 594.2887 605.7877 627.3398 641.7389 678.5728 728.5810 744.0441 769.4430 809.1347 836.6229 871.1605 880.0965 915.9190 925.1868 946.1976 964.2723 979.6697 990.8933 996.1955 1015.0466 1033.5212 1041.1632 1042.7588 1044.5481 1085.5845 1115.8258 1120.3722 1162.3017 1174.4852 1184.7337 1199.0046 1200.5293 1224.6094 1235.8352 1261.1708 1295.1175 1306.4643 1335.8465 1339.9759 1353.2779 1367.1635 1382.6748 1384.5966 1387.4334 1441.8087 1449.7105 1452.1894 1454.0911 1454.1183 1455.5292 1467.1626 1472.0385 1488.7209 1590.5171 1611.0215 1615.3082 1646.4486 2981.0178 2993.7798 2995.4502 3005.7124 3015.9436 3037.5841 3061.6065 3073.4653 3095.9944 3099.1004 3100.5205 3114.5276 3119.8966 3138.9069 3139.0573 3160.6713 3552.1811
redmass: 4.7987 6.1199 2.6981 1.3539 4.0908 2.6538 3.4308 1.1816 4.0387 3.6002 5.7351 7.0476 3.7049 2.9618 3.9865 2.8294 3.4058 2.9998 3.8284 2.8845 3.7873 4.1382 1.5238 3.6079 3.2580 3.6269 2.7320 4.5470 4.2372 2.5727 3.9129 2.6924 1.5570 3.3041 3.6619 2.5999 1.5303 2.9313 3.7713 2.2329 1.9793 1.7035 1.3275 1.8612 2.3848 2.4971 1.7267 1.6915 2.0853 3.8831 1.8638 1.5724 1.2016 1.0801 1.4129 2.2603 3.0442 1.8166 1.7766 1.6740 1.2593 1.6882 1.5326 1.5464 1.3789 1.8137 1.4962 2.5080 1.2758 2.3748 1.0965 1.1517 1.4324 1.0647 1.0619 1.0937 1.2668 2.4014 6.9151 6.5868 6.3996 9.7965 1.0627 1.0655 1.0360 1.0381 1.0833 1.0971 1.0875 1.0973 1.0993 1.0942 1.0994 1.0866 1.0892 1.0932 1.1025 1.1005 1.0786
irintensity: 0.1568 4.0457 3.9441 2.5265 2.0815 6.0415 1.7947 0.1910 0.6079 2.0240 8.4049 5.4599 4.5744 3.6193 3.4635 0.5474 3.2088 0.3157 6.3843 19.6023 7.1121 7.3628 76.0631 14.1281 4.2873 4.2598 5.5256 2.9539 7.8271 2.7200 0.7134 14.1428 53.2709 6.5244 7.2130 21.7281 1.3722 16.5153 50.9444 13.0692 1.6755 4.4211 0.1823 65.5278 6.2062 25.0917 11.7796 8.3848 18.6436 7.6271 6.0145 1.4163 24.6515 2.7221 26.2599 32.5882 349.8534 1.3509 44.8286 5.3081 21.3866 13.7246 1.5985 0.4985 5.7267 7.9549 39.5555 26.7509 57.9330 16.8589 44.1513 31.0791 236.4618 18.9347 27.7680 11.9709 57.9597 25.6788 5.2617 158.6641 20.3404 193.0397 19.9877 20.4636 11.5865 2.2621 6.3632 26.7244 11.7761 18.8372 13.5738 7.6974 13.7453 11.1887 2.2538 25.2033 10.7386 31.4598 18.4974
temp: 298.150 k
press: 1.00000 atm
elementType: 8 8 8 7 6 6 6 6 6 6 6 6 6 6 6 6 6 6 1 1 1 1 1 1 1 1 1 1 1 1 1 1 1 1 1
symmnumber: 1
zpe: 746528.6 jmol-1
zpe.correction: 0.284338 hartree
zpe.thermalcorrener: 0.302035 hartree
zpe.thermalcorrenthalpy: 0.302979 hartree
zpe.thermalcorrgfe: 0.236671 hartree
zpe.sumelectzpe: -822.814417 hartree
zpe.sumelectthermal: -822.796720 hartree
zpe.sumelectthermalent: -822.795776 hartree
zpe.sumelectthermalfe: -822.862084 hartree
dipole: -4.1826 -1.1993 1.4380
dipole: 4.5826
quadrupole: -110.9832 -98.0802 -103.3736
quadrupole: -9.0909 -3.8864 6.6142
quadrupole: -6.8375 6.0655 0.7721 -9.0909 -3.8864 6.6142
hfenergy: -823.098755 hartree
pointgroup: C01 [X(C14H17N1O3)]
dipole: 1.59756 -0.6387615 0.5388111 debye
polarizability: 192.2796381|-4.3200257|162.8262177|-0.1047869|15.0801978|133.0786428 unknown
InChI: InChI=1S/C14H17NO3/c1-9(16)15-14-12-6-4-3-5-11(12)7-8-13(14)18-10(2)17/h3-6,13-15H,7-8H2,1-2H3
charge 0 multiplicity 1
35 atoms
O  -0.739628 1.808653 -0.395399
O  -2.813513 -1.688935 -0.983951
O  -2.444052 2.900234 0.767339
N  -0.841441 -1.845044 0.227371
C  -0.301281 -0.566937 -0.297734
C  -0.894846 0.616419 0.502747
C  -0.156846 0.854039 1.827656
C  1.334302 1.158188 1.578849
C  1.226384 -0.618073 -0.276963
C  1.993706 0.165589 0.628741
C  1.884712 -1.495257 -1.176696
C  3.40701 0.038599 0.612136
C  3.289235 -1.610154 -1.186753
C  4.056099 -0.837099 -0.281823
C  -2.077511 -2.331535 -0.173609
C  -1.613006 2.879733 -0.168585
C  -2.487123 -3.676216 0.419252
C  -1.42098 3.951809 -1.219169
H  -0.675001 -0.47122 -1.335067
H  -1.974835 0.455746 0.661608
H  -0.267414 -0.062946 2.4404
H  -0.641487 1.677521 2.379197
H  1.883294 1.184426 2.538656
H  1.420507 2.172817 1.141031
H  -0.250639 -2.392529 0.855201
H  1.282101 -2.087794 -1.876231
H  4.001782 0.639287 1.311882
H  3.782267 -2.288724 -1.891344
H  5.148905 -0.91758 -0.276368
H  -3.412443 -3.545561 1.006925
H  -2.720043 -4.374332 -0.402893
H  -1.715357 -4.128681 1.065853
H  -2.057687 3.719536 -2.092646
H  -0.375713 3.986361 -1.563349
H  -1.73166 4.927859 -0.816766
