program: Gaussian 09
title: 000222947
version: EM64L-G09RevD.01
frameworkgroup: C1[X(C4HClN2O4S)]
method: RPBEPBE
basis: SDD
operation: Freq
keyword: #p
keyword: freq=noraman
keyword: PBEPBE/SDD
title: #p freq=noraman PBEPBE/SDD
converged: NO NO NO NO
title: Mulliken charges:
elementType: Cl S O O O O N N C C C C H
charge: 0.168495 0.469439 -0.187819 -0.179492 -0.179451 -0.195935 0.038849 0.088444 0.645538 -0.270749 -0.081925 -0.661532 0.346138
chargesum: 0.00000
title: Mulliken charges with hydrogens summed into heavy atoms:
elementType: Cl S O O O O N N C C C C
charge: 0.168495 0.469439 -0.187819 -0.179492 -0.179451 -0.195935 0.038849 0.088444 0.645538 0.075389 -0.081925 -0.661532
polarizability: 1.61677448e+02 7.03659285e+00 1.24738911e+02 5.28839547e-03 7.04335321e-03 3.45705505e+01
1716.lowfreq: -8.7690 -7.7567 -0.0007 0.0013 0.0021 4.7505 35.3776 68.6499 99.3170
frequency: 35.3664 68.6493 99.3154 129.3732 149.7742 181.6257 274.0485 288.7413 306.1771 341.3550 414.3804 453.2856 454.0183 550.8777 605.9152 663.6992 673.0999 701.6001 712.8665 728.7120 861.3840 921.7631 990.6097 1037.8552 1141.2214 1201.6476 1219.8885 1336.6080 1363.6644 1381.3857 1461.2730 1540.9913 3217.7333
redmass: 16.3358 16.7470 19.6174 15.8530 8.8355 20.8315 14.6279 12.0390 17.2642 17.9155 20.5283 19.7282 6.5573 6.1543 7.3417 11.3723 9.8987 8.0418 9.7947 10.5952 13.5830 1.4082 11.1433 4.3443 1.8439 13.1092 9.2626 6.9956 14.3359 11.4380 12.0760 8.2266 1.0963
irintensity: 0.0864 0.3128 2.9706 5.3259 4.0808 0.0533 0.4191 0.3524 0.5345 0.5819 1.6492 1.7675 8.3271 0.4066 28.5081 5.7323 19.6711 22.2008 2.5242 11.3360 2.7631 28.9853 43.3809 18.5652 54.4264 397.7945 142.0412 87.3844 74.5297 59.3921 191.0071 55.3994 27.6039
temp: 298.150 k
press: 1.00000 atm
elementType: 17 16 8 8 8 8 7 7 6 6 6 6 1
symmnumber: 1
zpe: 152577.1 jmol-1
zpe.correction: 0.058114 hartree
zpe.thermalcorrener: 0.068938 hartree
zpe.thermalcorrenthalpy: 0.069882 hartree
zpe.thermalcorrgfe: 0.019451 hartree
zpe.sumelectzpe: -1420.459270 hartree
zpe.sumelectthermal: -1420.448446 hartree
zpe.sumelectthermalent: -1420.447502 hartree
zpe.sumelectthermalfe: -1420.497932 hartree
dipole: -0.9180 -2.6081 0.0099
dipole: 2.7650
quadrupole: -104.9425 -85.4965 -78.8954
quadrupole: 6.3228 -0.0019 0.0115
quadrupole: -15.1644 4.2817 10.8827 6.3228 -0.0019 0.0115
hfenergy: -1420.5173839 hartree
pointgroup: C01 [X(C4H1Cl1N2O4S1)]
dipole: 0.2331399 1.0625434 0.0043461 debye
dipolederiv: -0.3444005 -0.3430615 -0.0002105 -0.3903695 -0.3549698 -0.0001791 -0.000204 -0.0002222 0.1044979 -0.1392617 0.0900591 0.0000948 0.0238115 0.0260899 -0.0000125 0.0002448 -0.0000559 0.2657402 -0.4801859 0.0982278 0.000358 0.093946 -0.791117 0.0008117 0.0001752 -0.0015576 -0.2220401 -0.7751583 -0.0124356 -0.000625 -0.0418214 -0.4259603 -0.0006932 0.0014924 0.000447 -0.2054341 -0.6260441 -0.1974175 -0.0001673 -0.327951 -0.7311476 0.0003405 -0.0006209 -0.00074 -0.2039877 -0.7674924 0.1129098 -0.0000148 0.1480788 -0.5382244 -0.0002602 -0.0007125 0.0004458 -0.2144655 1.5029692 -0.4294499 -0.0004855 -0.3080728 1.2841138 0.0002877 -0.0006059 0.0003538 0.2222519 1.9001956 0.2400784 0.0007415 0.2476488 1.0313633 -0.0000714 0.0009828 0.0001094 0.2225614 -0.6213435 0.1355856 0.0004721 0.0287686 -0.6930562 -0.0004905 -0.0006757 0.0004017 0.1009005 0.5027615 0.1499893 0.0000631 -0.0207944 -0.2159464 -0.0002129 0.0000774 0.0003792 -0.0291552 -1.0074294 -0.115942 -0.0003908 0.2463117 0.29074 0.0000847 -0.0001306 0.0001197 -0.0925573 0.7029002 0.2624114 0.0001774 0.3239943 0.959476 0.0004054 -0.0000998 0.0004064 -0.1625365 0.1524894 0.0090451 -0.0000129 -0.0235506 0.1586389 -0.0000102 0.0000769 -0.0000872 0.2142245 unknown
polarizability: 159.4201121|11.3048959|126.9962359|0.010942|0.0316435|34.570561 unknown
InChI: InChI=1S/C4HClN2O4S/c5-4-2(6(8)9)1-3(12-4)7(10)11/h1H
charge 0 multiplicity 1
13 atoms
Cl 2.127703 2.478768 0.000769
S  -0.844026 1.773701 0.000495
O  2.150638 -2.200143 -0.002244
O  3.362124 -0.260234 -0.002067
O  -3.05347 -1.552461 -0.001727
O  -3.574044 0.687447 -0.001977
N  2.252225 -0.912202 0.001387
N  -2.737152 -0.302337 -0.000109
C  0.993579 -0.154209 0.00089
C  -0.266502 -0.843812 0.000598
C  -1.33162 0.032928 0.000253
C  0.87497 1.239939 0.000553
H  -0.356325 -1.930886 0.000681
