program: Gaussian 09
title: 000222986
version: EM64L-G09RevD.01
frameworkgroup: C1[X(C20H18O4)]
method: RPBEPBE
basis: SDD
operation: Freq
keyword: #pfreq=noraman
keyword: PBEPBE/SDD
title: #p freq=noraman PBEPBE/SDD
converged: YES YES NO NO
title: Mulliken charges:
elementType: O O O O C C C C C C C C C C C C C C C C C C C C H H H H H H H H H H H H H H H H H H
charge: -0.293976 -0.288586 -0.286184 -0.218515 0.492717 -0.668017 0.392033 0.384812 0.398890 -0.590398 -0.495132 -0.443926 0.253599 -0.407756 -0.333928 0.181690 0.243700 -0.409744 -0.406709 -0.326399 -0.240758 -0.241670 -0.537058 -0.520376 0.245044 0.247700 0.262558 0.271554 0.236329 0.238953 0.270282 0.239843 0.252684 0.240561 0.229635 0.229330 0.228780 0.242075 0.228662 0.258672 0.228882 0.210144
chargesum: 0.00000
title: Mulliken charges with hydrogens summed into heavy atoms:
elementType: O O O O C C C C C C C C C C C C C C C C C C C C
charge: -0.293976 -0.288586 -0.286184 -0.218515 0.492717 -0.175273 0.392033 0.384812 0.398890 -0.327840 -0.223578 -0.207597 0.253599 -0.168802 -0.063646 0.181690 0.243700 -0.169901 -0.166148 -0.073715 -0.011123 -0.012340 0.162459 0.177323
polarizability: 3.54418412e+02 -1.77004673e+01 2.20803974e+02 -6.17794433e+00 8.03779023e+00 1.56806466e+02
1716.lowfreq: -18.7056 -8.3725 -0.0004 -0.0003 0.0004 2.4497 4.3432 12.7915 13.6259
frequency: -8.4890 12.5612 13.1491 49.2173 55.1849 72.2205 91.5438 97.2263 107.8687 154.2551 158.2466 172.9840 187.9513 195.6507 221.1983 261.0522 275.3215 288.4287 296.9961 314.3521 344.2920 392.7664 398.2205 411.5450 438.6071 471.4867 478.3995 482.3738 510.4349 521.8158 528.4410 540.0815 594.5998 598.9246 619.1882 641.4887 677.6169 715.6468 720.6536 725.1587 757.8124 759.5970 764.9483 777.5942 811.0092 820.8993 836.0418 870.5179 871.4005 906.1515 909.2870 916.4449 939.9904 947.5973 955.4436 957.8532 959.5149 972.6474 992.3273 998.5586 1023.2612 1078.4572 1110.5487 1110.9529 1113.9278 1116.0314 1142.1733 1144.8859 1155.4001 1158.5790 1159.7287 1173.5582 1207.9879 1218.5770 1232.8014 1245.9818 1259.1411 1268.8397 1272.2729 1294.8802 1353.3812 1380.7773 1405.6893 1410.3695 1424.9730 1426.7962 1436.8515 1444.0725 1451.0980 1454.7686 1459.6624 1466.8874 1473.2950 1480.8662 1498.9219 1513.6942 1583.2250 1584.7194 1604.6623 1608.7138 1641.8991 1646.3780 2966.2038 2974.2012 3007.9225 3056.2746 3082.7580 3100.2780 3122.0645 3125.6930 3126.6015 3127.5640 3134.8378 3138.5385 3144.4320 3154.2786 3155.2577 3163.4512 3167.9720 3194.9432
redmass: 5.1847 4.8183 4.9795 5.1798 2.6015 3.3355 5.3382 3.0180 3.3844 4.3799 2.1293 3.1263 3.4794 3.8727 2.5149 2.3281 4.1333 2.7590 4.5699 4.8814 3.4288 4.5514 3.4087 4.2796 4.4268 4.2960 2.6307 3.5359 6.5606 5.0404 3.9566 5.2983 4.5576 5.3163 6.1336 3.2597 6.0795 4.7518 4.2492 4.5115 4.9088 1.6455 3.0101 2.4980 2.0009 1.4356 2.2355 1.4939 1.7516 3.0084 2.2165 3.8669 1.5091 2.6411 1.6990 2.2568 6.2973 1.4081 1.3428 4.7115 2.2672 2.3985 1.2396 1.2581 2.0350 1.9911 1.7434 1.7186 1.3911 1.4714 1.2921 1.0790 1.8688 1.4810 2.6199 1.4629 3.2708 1.4058 1.7785 1.9992 1.8000 6.4343 2.1514 5.7521 3.7654 1.2098 3.1483 1.2701 1.1279 1.0799 2.5205 1.0498 1.1106 1.0556 2.5290 3.7478 7.5083 7.7204 5.8559 6.1763 7.2541 10.4451 1.0324 1.0348 1.0636 1.1042 1.0970 1.0979 1.0857 1.1003 1.1046 1.0890 1.0904 1.0890 1.0951 1.0924 1.0907 1.1004 1.0958 1.0949
irintensity: 0.4390 0.2837 0.7073 0.0848 6.3939 2.0192 3.7343 5.2782 3.8125 3.3058 2.7169 0.1272 1.6299 0.3832 1.1379 1.9042 1.9132 0.6222 4.2606 1.5704 7.3072 1.0257 0.3496 3.4741 8.5031 11.5765 27.0412 3.2021 0.5665 6.3127 2.1583 1.0505 5.9103 12.9694 4.1663 0.8059 4.6608 10.6643 9.5902 7.7176 2.7337 38.5832 23.3101 3.9179 77.3004 48.7187 6.2900 38.8148 16.7869 40.0963 8.2087 20.5493 6.2540 15.0939 28.9555 53.0989 41.5266 7.5640 0.0039 39.6421 3.1575 507.5606 9.7886 1.4542 66.8389 106.9001 37.8673 67.3768 9.5257 10.9930 6.3657 0.2172 77.5861 245.8477 46.0559 5.2530 155.3939 34.8647 6.2338 65.1298 4.9120 24.9867 29.0620 2.6958 1.9212 4.2934 1.7065 12.4794 32.6298 10.2805 26.1312 13.7915 75.4425 31.3784 140.4564 41.6239 5.1339 18.1090 17.9006 9.7545 38.9877 144.5779 54.4171 83.2263 14.0735 41.1848 41.0704 4.8677 2.9251 23.3174 21.7768 0.3802 8.3326 9.8659 32.3370 5.3233 2.3877 36.5530 7.3101 1.6756
temp: 298.150 k
press: 1.00000 atm
elementType: 8 8 8 8 6 6 6 6 6 6 6 6 6 6 6 6 6 6 6 6 6 6 6 6 1 1 1 1 1 1 1 1 1 1 1 1 1 1 1 1 1 1
symmnumber: 1
zpe: 859790.5 jmol-1
zpe.correction: 0.327477 hartree
zpe.thermalcorrener: 0.348386 hartree
zpe.thermalcorrenthalpy: 0.349330 hartree
zpe.thermalcorrgfe: 0.275174 hartree
zpe.sumelectzpe: -1072.099522 hartree
zpe.sumelectthermal: -1072.078613 hartree
zpe.sumelectthermalent: -1072.077669 hartree
zpe.sumelectthermalfe: -1072.151825 hartree
dipole: 1.6159 1.2761 0.1488
dipole: 2.0644
quadrupole: -134.4560 -121.5053 -140.3213
quadrupole: -10.9380 -7.6447 -1.6447
quadrupole: -2.3618 10.5889 -8.2271 -10.9380 -7.6447 -1.6447
hfenergy: -1072.4269991 hartree
pointgroup: C01 [X(C20H18O4)]
dipole: 0.646952 -0.3003577 0.388485 debye
polarizability: 353.5940269|11.9087353|178.7704329|-17.6940606|-31.811666|199.6643929 unknown
InChI: InChI=1S/C20H18O4/c1-22-18-10-7-14(11-19(18)23-2)12-20(21)24-17-9-8-15-5-3-4-6-16(15)13-17/h3-11,13H,12H2,1-2H3
charge 0 multiplicity 1
42 atoms
O  0.863718 0.146718 -1.406533
O  -4.967542 -1.403076 0.997653
O  -5.871149 1.303737 0.983142
O  -0.177339 -1.917807 -0.966134
C  -2.524455 0.19173 -1.391642
C  -1.344787 -0.188922 -2.2906
C  4.460178 0.213535 -0.447199
C  4.429192 -0.407498 0.862811
C  2.044228 -0.113114 -0.634745
C  3.238294 0.348688 -1.181681
C  -3.161401 -0.794842 -0.597201
C  -3.003977 1.519461 -1.35965
C  -4.265579 -0.465866 0.219633
C  3.171938 -0.859634 1.383916
C  1.98894 -0.719819 0.658446
C  -4.739267 0.884712 0.263959
C  -0.195732 -0.784967 -1.489568
C  5.714832 0.67442 -0.968798
C  5.653216 -0.544649 1.596772
C  -4.100213 1.855434 -0.534197
C  6.890732 0.526303 -0.229908
C  6.860718 -0.088141 1.063384
C  -4.536861 -2.802838 0.922921
C  -5.956019 0.950887 2.41576
H  -1.660609 -0.958527 -3.020106
H  -0.985737 0.692637 -2.842863
H  3.233433 0.818425 -2.170652
H  -2.779311 -1.820086 -0.626878
H  -2.522645 2.293558 -1.967039
H  3.145965 -1.324037 2.376484
H  1.037375 -1.072424 1.060189
H  5.7383 1.144578 -1.959037
H  -4.487542 2.878061 -0.491716
H  5.627849 -1.014805 2.587137
H  7.844058 0.88018 -0.637421
H  7.790846 -0.197332 1.631615
H  -4.616817 -3.189877 -0.110868
H  -5.228901 -3.349981 1.579842
H  -3.498269 -2.926052 1.285479
H  -6.0088 -0.140909 2.552573
H  -6.879864 1.434098 2.76878
H  -5.085601 1.359539 2.965238
