program: Gaussian 09
title: 000222946
version: EM64L-G09RevD.01
frameworkgroup: C1[X(C9H16O4)]
method: RPBEPBE
basis: SDD
operation: Freq
keyword: #pfreq=noraman
keyword: PBEPBE/SDD
title: #p freq=noraman PBEPBE/SDD
converged: YES YES NO NO
title: Mulliken charges:
elementType: O O O O C C C C C C C C C H H H H H H H H H H H H H H H H
charge: -0.265509 -0.274209 -0.268334 -0.236514 -0.056639 -0.703120 0.238716 -0.228195 -0.261492 -0.310686 -0.659723 -0.050448 -0.558620 0.246009 0.233033 0.231308 0.233468 0.244007 0.204252 0.236126 0.223779 0.219392 0.196815 0.217454 0.248002 0.229372 0.233433 0.220657 0.217666
chargesum: 0.00000
title: Mulliken charges with hydrogens summed into heavy atoms:
elementType: O O O O C C C C C C C C C
charge: -0.265509 -0.274209 -0.268334 -0.236514 0.189370 -0.005311 0.238716 0.220063 0.198412 0.105521 0.035106 0.182986 -0.120297
polarizability: 1.30531378e+02 5.01278783e-02 9.56321743e+01 -8.15613840e+00 1.61490729e-01 1.10059883e+02
1716.lowfreq: -15.7463 -6.6608 0.0005 0.0009 0.0009 7.1267 16.8348 25.7726 30.7944
frequency: 16.5122 25.6836 30.7659 57.1009 69.7082 82.7636 98.3698 124.6502 164.1637 191.7131 202.5279 226.2467 254.6643 285.1249 328.4327 335.2987 383.4298 416.1984 450.7329 467.6403 583.6695 604.8973 630.4541 704.2920 770.7121 799.1295 818.3670 858.3820 865.6399 929.4902 942.4667 955.9506 973.9900 1007.6381 1009.7380 1022.2065 1040.3462 1078.4709 1094.4782 1096.4880 1126.8932 1148.1123 1154.6192 1158.5101 1206.5811 1240.7655 1278.0184 1282.1623 1291.7816 1314.5848 1341.3789 1354.6182 1364.2766 1383.5560 1392.1198 1431.0885 1456.9028 1457.6030 1462.0547 1463.4216 1474.0524 1478.1271 1484.1196 1640.9188 1664.4742 2927.0769 2986.0060 2993.3054 2996.3094 3004.8254 3021.4317 3029.4726 3088.7801 3089.4918 3093.0048 3094.0353 3105.9025 3118.7268 3119.1124 3119.2354 3199.6340
redmass: 4.0699 3.0631 3.4644 2.2723 5.1894 3.4825 2.9100 3.6736 3.7350 2.1512 1.1189 1.5255 2.5371 2.3817 3.2874 5.1732 4.0240 2.2904 2.6465 3.2765 3.0691 5.0664 1.9903 4.2195 2.0248 3.2409 1.5919 3.1215 2.8512 2.5346 1.8225 1.5018 2.0118 1.7126 2.0191 2.2680 2.6911 2.3213 2.5918 2.1248 2.4384 1.6910 1.7651 2.1194 1.2691 1.1129 1.1174 1.2399 1.3168 1.3387 1.2578 1.2737 1.1857 1.2109 1.2326 1.1967 1.0891 1.0863 1.0476 1.0450 1.0891 1.0540 1.0514 9.8315 4.8241 1.0639 1.0825 1.0361 1.0581 1.0347 1.0965 1.0594 1.0974 1.0606 1.1034 1.1082 1.1009 1.0946 1.1019 1.1046 1.1143
irintensity: 0.4216 0.1433 0.2787 0.9828 0.8460 1.4438 0.8548 8.1571 4.9852 2.0299 0.3004 1.5074 6.8041 17.1985 6.1934 8.4603 6.4244 1.3221 4.9207 3.5078 10.7048 18.2955 2.9788 3.7102 8.8465 6.4264 1.6761 11.3902 25.8294 115.6791 269.7493 37.6610 89.9134 76.1460 3.1122 44.9064 91.8190 184.8400 88.8033 21.4888 119.7485 7.6077 26.2401 11.5158 3.6014 1.0158 2.9468 0.1363 0.0765 3.8147 11.2497 0.6926 3.1656 19.9094 21.3038 15.7172 11.8133 5.7701 16.9932 12.6320 4.0046 11.9705 13.8344 154.9984 4.4719 50.9033 15.7717 18.0006 64.9533 16.8217 27.4931 31.4098 36.7966 10.4209 0.9162 16.6004 22.8735 10.9625 36.2739 12.8913 28.2710
temp: 298.150 k
press: 1.00000 atm
elementType: 8 8 8 8 6 6 6 6 6 6 6 6 6 1 1 1 1 1 1 1 1 1 1 1 1 1 1 1 1
symmnumber: 1
zpe: 628252.6 jmol-1
zpe.correction: 0.239289 hartree
zpe.thermalcorrener: 0.255277 hartree
zpe.thermalcorrenthalpy: 0.256221 hartree
zpe.thermalcorrgfe: 0.192592 hartree
zpe.sumelectzpe: -652.348685 hartree
zpe.sumelectthermal: -652.332697 hartree
zpe.sumelectthermalent: -652.331752 hartree
zpe.sumelectthermalfe: -652.395382 hartree
dipole: 0.3478 0.6286 1.7462
dipole: 1.8882
quadrupole: -64.4645 -79.4928 -79.0237
quadrupole: 4.1712 3.7834 -2.5687
quadrupole: 9.8625 -5.1658 -4.6967 4.1712 3.7834 -2.5687
hfenergy: -652.5879734 hartree
pointgroup: C01 [X(C9H16O4)]
dipole: -0.1049452 0.3089108 -0.6674214 debye
polarizability: 130.7054068|-1.810697|95.8309004|-7.8688287|-0.744494|109.687128 unknown
InChI: InChI=1S/C9H16O4/c1-4-6-11-7-13-8(3)9(10)12-5-2/h4,8H,1,5-7H2,2-3H3
charge 0 multiplicity 1
29 atoms
O  0.341645 -1.399625 0.522941
O  -2.548486 0.4053 -0.898273
O  1.878721 0.448972 0.867581
O  -2.165355 -0.287005 1.299046
C  -0.498422 -0.771911 -0.50218
C  -0.775448 -1.850044 -1.562582
C  -1.803464 -0.217674 0.104082
C  0.938917 -0.469412 1.479924
C  -3.845455 1.031035 -0.484005
C  3.105449 -0.215807 0.360507
C  -3.620835 2.466188 -0.00153
C  4.095284 0.860202 0.002071
C  4.760135 0.924487 -1.177569
H  0.038154 0.085063 -0.959298
H  -1.293858 -2.710711 -1.106585
H  0.181801 -2.203845 -1.980732
H  -1.398192 -1.439747 -2.373861
H  0.175692 0.168717 1.954665
H  1.431411 -1.135791 2.2140
H  -4.29862 0.405643 0.305097
H  -4.455288 0.990811 -1.400589
H  2.865146 -0.855159 -0.510586
H  3.508499 -0.868102 1.168546
H  -4.595048 2.942068 0.216536
H  -3.017599 2.480609 0.921658
H  -3.108599 3.066085 -0.773257
H  4.272993 1.612296 0.783047
H  5.496906 1.710056 -1.377941
H  4.589319 0.192402 -1.976915
