program: Gaussian 09
title: 000222985
version: EM64L-G09RevD.01
frameworkgroup: C1[X(C19H21NO4)]
method: RPBEPBE
basis: SDD
operation: Freq
keyword: #p
keyword: freq=noraman
keyword: PBEPBE/SDD
title: #p freq=noraman PBEPBE/SDD
converged: YES YES NO NO
title: Mulliken charges:
elementType: O O O O N C C C C C C C C C C C C C C C C C C C H H H H H H H H H H H H H H H H H H H H H
charge: -0.239882 -0.233722 -0.295146 -0.283494 -0.408789 0.448658 0.118250 -0.719801 0.244823 -0.475951 0.574066 -0.555215 -0.490279 0.184726 0.208519 -0.606001 -0.413968 0.218381 -0.327589 0.199168 -0.539662 -0.537727 -0.521897 -0.536948 0.224519 0.219124 0.267213 0.297422 0.264592 0.242360 0.259112 0.240736 0.235870 0.239831 0.218420 0.224376 0.245838 0.214053 0.215081 0.208803 0.257502 0.226758 0.219426 0.226752 0.241691
chargesum: 0.00000
title: Mulliken charges with hydrogens summed into heavy atoms:
elementType: O O O O N C C C C C C C C C C C C C C C C C C C
charge: -0.239882 -0.233722 -0.295146 -0.283494 -0.111367 0.448658 0.118250 -0.276157 0.244823 -0.208738 0.574066 -0.290622 -0.247919 0.184726 0.208519 -0.346889 -0.173232 0.218381 -0.091719 0.199168 0.142964 0.137245 0.171166 0.150921
polarizability: 2.82440853e+02 1.67586588e+01 2.46985766e+02 2.17513421e+01 2.86953115e+00 1.76979134e+02
1716.lowfreq: -4.4401 -1.8501 -0.0006 -0.0004 -0.0001 5.4877 11.8971 16.3761 28.6310
frequency: 11.7290 16.1741 28.6139 66.7871 74.0492 77.9502 84.4582 117.1287 129.9001 134.5473 150.2032 155.5790 181.4605 190.2279 200.4919 215.7384 228.9337 248.2611 252.4909 260.1603 278.5972 313.4367 323.6147 349.8580 366.0355 370.6867 382.2211 407.8459 438.9653 453.0969 468.9046 471.2762 480.0516 483.4576 537.5665 567.1283 604.0042 606.9300 620.8752 682.2530 706.6962 716.0723 717.0004 727.4896 734.9166 754.4441 773.5432 799.5378 815.5328 823.1323 830.2729 859.4241 880.1514 888.0218 930.8350 947.8646 954.4892 985.7019 991.9870 995.2894 1048.6279 1090.5472 1106.0145 1111.6141 1111.7879 1112.3487 1113.0862 1142.9043 1144.7815 1156.5256 1157.9886 1165.9822 1171.7580 1175.9004 1194.9591 1202.4516 1239.5632 1251.2903 1252.7411 1273.9724 1288.8594 1316.2951 1325.1359 1377.6497 1394.9664 1404.0613 1409.0239 1428.7248 1432.3866 1441.9405 1443.7114 1455.1157 1456.7146 1464.5459 1464.8182 1466.3498 1472.3009 1474.0588 1475.2876 1480.8225 1483.4697 1490.3383 1496.6213 1562.4077 1581.5165 1591.8767 1615.4424 1639.6128 2946.8826 2953.7689 2960.0262 2960.4196 2971.0558 3004.9153 3030.4618 3038.2814 3048.0818 3078.6674 3120.3979 3121.3695 3121.8578 3122.5579 3133.1293 3138.5941 3156.0270 3158.9585 3168.7820 3217.8092 3617.6758
redmass: 4.8805 4.7747 4.0687 3.8128 2.2989 3.8605 3.2539 4.1159 4.1388 2.3295 3.4873 2.1188 3.5205 3.0246 2.6394 2.9300 1.9810 1.4825 1.2152 1.9196 2.0439 3.2517 4.3404 4.2258 3.8410 5.6172 5.4210 3.9281 2.6546 4.2818 3.2805 1.5973 4.7625 3.7567 4.4267 5.1462 3.7896 3.3246 4.2591 4.6501 7.0271 5.1273 5.9371 3.4455 2.9710 2.0528 1.7341 2.0733 2.6898 1.8721 4.1967 1.7553 4.0921 1.6447 1.4622 1.9329 6.8817 7.5193 5.7411 4.2871 4.0372 1.6580 2.4823 1.2624 1.2598 1.2410 1.2631 1.6849 1.6816 1.3768 1.3639 1.9994 1.4241 1.3412 2.1190 2.0123 2.3053 1.7754 1.7796 2.2861 2.4764 1.7077 2.8575 6.0100 4.1316 2.4350 2.5111 1.2728 1.2367 1.3367 1.4305 1.0792 1.1090 1.0501 1.0505 1.0509 1.2227 1.1084 1.1247 3.0862 1.0553 2.4838 2.4027 6.5666 7.3734 7.2277 6.6604 7.2039 1.0334 1.0333 1.0379 1.0542 1.0348 1.1001 1.1033 1.1034 1.1038 1.0970 1.0984 1.0991 1.0997 1.1042 1.0881 1.0912 1.0906 1.0947 1.0908 1.0981 1.0808
irintensity: 0.3544 0.3955 0.5477 2.6081 5.1262 3.3703 13.1695 4.1851 0.2454 0.5768 0.0084 0.0983 5.4083 3.4459 1.6739 1.4839 4.1493 0.8279 1.0563 1.1152 0.2981 4.7113 4.4332 1.3389 1.4344 6.2038 6.9886 7.6097 0.3143 0.6211 35.4706 70.7245 2.2357 10.2381 11.1521 2.6340 1.5449 1.3261 7.4808 10.4741 0.9612 15.2675 7.4755 0.3088 5.4993 13.1174 38.8291 42.6983 2.0506 39.7883 49.3877 17.8893 6.2821 23.2474 1.5371 1.2360 24.8011 49.9236 21.1195 70.2806 33.7233 34.7982 76.0740 0.1499 1.8845 7.0018 0.1885 24.4970 75.6755 5.0006 10.3560 113.1856 13.4913 5.5923 91.1106 66.8416 67.9221 67.9096 111.4595 21.7867 15.1764 53.1300 127.3092 20.3412 4.2606 13.7063 64.0240 2.4889 1.1007 18.9553 0.0201 21.7708 7.5962 1.7721 23.0774 12.2250 95.8174 8.7180 81.1540 41.4130 28.0941 47.2712 129.4174 25.2582 18.7838 6.8766 11.8621 20.9163 91.9491 45.6580 94.4695 14.1472 100.6811 14.7728 53.2768 49.5936 44.9040 37.5751 20.0884 30.7075 26.8684 21.8187 4.7814 7.3543 13.3581 11.8335 4.6709 0.9854 58.8971
temp: 298.150 k
press: 1.00000 atm
elementType: 8 8 8 8 7 6 6 6 6 6 6 6 6 6 6 6 6 6 6 6 6 6 6 6 1 1 1 1 1 1 1 1 1 1 1 1 1 1 1 1 1 1 1 1 1
symmnumber: 1
zpe: 945604.4 jmol-1
zpe.correction: 0.360162 hartree
zpe.thermalcorrener: 0.383760 hartree
zpe.thermalcorrenthalpy: 0.384704 hartree
zpe.thermalcorrgfe: 0.305275 hartree
zpe.sumelectzpe: -1090.447828 hartree
zpe.sumelectthermal: -1090.424230 hartree
zpe.sumelectthermalent: -1090.423286 hartree
zpe.sumelectthermalfe: -1090.502715 hartree
dipole: -0.0076 2.7932 3.1832
dipole: 4.2350
quadrupole: -110.4330 -132.8798 -132.0366
quadrupole: 14.6173 1.2572 0.2774
quadrupole: 14.6835 -7.7633 -6.9201 14.6173 1.2572 0.2774
hfenergy: -1090.8079898 hartree
pointgroup: C01 [X(C19H21N1O4)]
dipole: -0.192435 -1.3373772 -0.9749394 debye
polarizability: 275.7889753|-25.467415|250.9461056|-20.1860599|-9.8398057|179.6706713 unknown
InChI: InChI=1S/C19H21NO4/c1-21-16-6-5-12(8-17(16)22-2)7-13-11-20-15-10-19(24-4)18(23-3)9-14(13)15/h5-6,8-11,20H,7H2,1-4H3
charge 0 multiplicity 1
45 atoms
O  2.709408 2.361442 0.029224
O  4.873039 1.134929 -0.81625
O  -4.027645 1.622931 1.368448
O  -4.355613 1.308709 -1.447606
N  2.583095 -3.226935 0.168859
C  0.671412 -2.236226 0.944297
C  1.608351 -1.199071 0.543774
C  -0.694545 -2.034897 1.559884
C  2.791515 -1.84511 0.06587
C  1.301423 -3.457242 0.698505
C  -1.653099 -1.169529 0.73575
C  1.54751 0.222377 0.543914
C  3.915705 -1.122162 -0.399885
C  2.65161 0.958509 0.083532
C  3.841862 0.28467 -0.387236
C  -2.450985 -0.185053 1.366529
C  -1.792037 -1.345041 -0.660384
C  -3.358823 0.617755 0.643319
C  -2.693844 -0.553249 -1.404373
C  -3.475411 0.441194 -0.769489
C  1.520889 3.081214 0.486378
C  6.09915 0.500149 -1.292841
C  -5.49466 1.712972 1.222609
C  -4.416554 1.197012 -2.906205
H  -0.58908 -1.575456 2.563812
H  -1.155168 -3.02943 1.73001
H  0.935718 -4.469037 0.866158
H  3.249531 -3.94784 -0.095487
H  0.63967 0.72645 0.885205
H  4.812273 -1.636333 -0.758193
H  -2.381861 -0.011184 2.446624
H  -1.174207 -2.09084 -1.172766
H  -2.76798 -0.703327 -2.48593
H  1.7638 4.146379 0.35775
H  1.306507 2.872131 1.553353
H  0.631156 2.822815 -0.121337
H  6.764139 1.33227 -1.567427
H  5.909202 -0.134215 -2.182153
H  6.5743 -0.11108 -0.499224
H  -5.971084 0.758428 1.520857
H  -5.775428 1.966168 0.187397
H  -5.798524 2.513082 1.915135
H  -4.799531 0.206718 -3.221616
H  -3.423655 1.37323 -3.363399
H  -5.116831 1.983423 -3.224892
